1-Butanone, 1-phenyl-
- Formula: C10H12O
- Molecular weight: 148.2017
- IUPAC Standard InChIKey: FFSAXUULYPJSKH-UHFFFAOYSA-N
- CAS Registry Number: 495-40-9
- Chemical structure:
View 3d structure (requires JavaScript / HTML 5) - Other names: Butyrophenone; n-Butyrophenone; Phenyl propyl ketone; Propyl phenyl ketone; 1-Phenyl-1-butanone

Condensed phase thermochemistry data

Data compiled by: Hussein Y. Afeefy, Joel F. Liebman, and Stephen E. Stein
Quantity | Value | Units | Method | Reference | Comment |
---|---|---|---|---|---|
ΔfH°liquid | -188.8 ± 1.9 | kJ/mol | Ccb | Colomina, Latorre, et al., 1961 | |
Quantity | Value | Units | Method | Reference | Comment |
ΔcH°liquid | -5461.3 ± 1.7 | kJ/mol | Ccb | Colomina, Latorre, et al., 1961 | Corresponding ΔfHºliquid = -188.7 kJ/mol (simple calculation by NIST; no Washburn corrections) |

Phase change data

Data compiled by: Robert L. Brown and Stephen E. Stein
Quantity | Value | Units | Method | Reference | Comment |
---|---|---|---|---|---|
Tboil | 501.7 | K | N/A | Weast and Grasselli, 1989 |
Reduced pressure boiling point
Tboil (K) | Pressure (bar) | Reference |
---|---|---|
394. to 396. | 0.027 | Frinton Laboratories Inc., 1986 |

Gas phase ion energetics data

Data compiled as indicated in comments:
LLK - Sharon G. Lias, Rhoda D. Levin, and Sherif A. Kafafi
RDSH - Henry M. Rosenstock, Keith Draxl, Bruce W. Steiner, and John T. Herron
Ionization energy determinations
IE (eV) | Method | Reference | Comment |
---|---|---|---|
9.1 ± 0.1 | EI | Dallinga, Nibbering, et al., 1981 | LLK |
9.08 | PI | McLoughlin and Traeger, 1979 | LLK |
9.4 ± 0.2 | EI | McLafferty and Wachs, 1967 | RDSH |
Appearance energy determinations
Ion | AE (eV) | Other Products | Method | Reference | Comment |
---|---|---|---|---|---|
C7H5O+ | 9.59 | C3H7 | PI | McLoughlin and Traeger, 1979 | LLK |
C8H10O+ | 9.5 ± 0.1 | C2H4 | EI | Dallinga, Nibbering, et al., 1981 | LLK |

Kovats' RI, non-polar column, isothermal

Column type | Active phase | Temperature (C) | I | Reference | Comment |
---|---|---|---|---|---|
Packed | Apiezon L | 130. | 1240. | Wehrli and Kováts, 1959 | Celite; Column length: 2.25 m |

Van Den Dool and Kratz RI, non-polar column, temperature ramp

Column type | Active phase | I | Reference | Comment |
---|---|---|---|---|
Capillary | DB-5 | 1253. | Su, Ho, et al., 2006 | 30. m/0.25 mm/0.25 μm, He, 50. C @ 2. min, 5. K/min; Tend: 250. C |
Capillary | HP-5 | 1285. | Solina, Baumgartner, et al., 2005 | 25. m/0.2 mm/1. μm, He, 5. K/min, 280. C @ 5. min; Tstart: 40. C |
Capillary | Ultra-2 | 1267.9 | Akporhonor, le Vent, et al., 1990 | 25. m/0.2 mm/0.33 μm, N2, 15. K/min; Tstart: 60.01 C |
Capillary | Ultra-2 | 1252.2 | Akporhonor, le Vent, et al., 1990 | 25. m/0.2 mm/0.33 μm, N2, 2. K/min; Tstart: 60.01 C |
Capillary | Ultra-2 | 1261. | Akporhonor, le Vent, et al., 1990 | 25. m/0.2 mm/0.33 μm, N2, 7. K/min; Tstart: 60.01 C |
Capillary | Ultra-2 | 1275.6 | Akporhonor, le Vent, et al., 1990 | 25. m/0.2 mm/0.33 μm, N2, 15. K/min; Tstart: 120.01 C |
Capillary | Ultra-2 | 1265.3 | Akporhonor, le Vent, et al., 1990 | 25. m/0.2 mm/0.33 μm, N2, 2. K/min; Tstart: 120.01 C |
Capillary | Ultra-2 | 1270.2 | Akporhonor, le Vent, et al., 1990 | 25. m/0.2 mm/0.33 μm, N2, 7. K/min; Tstart: 120.01 C |

Normal alkane RI, non-polar column, custom temperature program

Column type | Active phase | I | Reference | Comment |
---|---|---|---|---|
Capillary | HP-5 | 1259. | Splivallo, Bossi, et al., 2007 | He; Program: 50C => 3C/min => 200C(10min) => 10C/min => 290C(10min) |
Capillary | Methyl Silicone | 1240. | N/A | Program: not specified |

Normal alkane RI, polar column, custom temperature program

Column type | Active phase | I | Reference | Comment |
---|---|---|---|---|
Capillary | DB-Wax | 1793. | Gyawali and Kim, 2012 | 60. m/0.20 mm/0.25 μm, Helium; Program: 40 0C (3 min) 2 0C/min -> 150 0C 4 0C/min -> 220 0C (20 min) 5 0C/min -> 230 0C |
Capillary | DB-Wax | 1792. | Kim. J.H., Ahn, et al., 2004 | 60. m/0.25 mm/0.25 μm, Helium; Program: 60 0C (3 min) 2 0C/min -> 150 0C 4 0C/min -> 200 0C |

References

Colomina, Latorre, et al., 1961
Colomina, M.; Latorre, C.; Perez-Ossorio, R.,
Heats of combustion of five alkyl phenyl ketones,
Pure & Appl. Chem., 1961, 2, 133-135. [all data]
Weast and Grasselli, 1989
CRC Handbook of Data on Organic Compounds, 2nd Editon, Weast,R.C and Grasselli, J.G., ed(s)., CRC Press, Inc., Boca Raton, FL, 1989, 1. [all data]
Frinton Laboratories Inc., 1986
Frinton Laboratories Inc.,
Catalog Number 11, Frinton Laboratories Inc., Vineland, NJ, 1986, 99. [all data]
Dallinga, Nibbering, et al., 1981
Dallinga, J.W.; Nibbering, N.M.M.; Louter, G.J.,
Formation and structure of [C8H8O]+ ions, generated from gas phase ions of phenylcyclopropylcarbinol and 1-phenyl-1-(hydroxymethyl)cyclopropane,
Org. Mass Spectrom., 1981, 16, 4. [all data]
McLoughlin and Traeger, 1979
McLoughlin, R.G.; Traeger, J.C.,
A photoionization study of some benzoyl compounds - thermochemistry of [C7H5O]+ formation,
Org. Mass Spectrom., 1979, 14, 434. [all data]
McLafferty and Wachs, 1967
McLafferty, F.W.; Wachs, T.,
Substituent effects in unimolecular ion decompositions. IX. Specific hydrogenrearrangement in butyrophenones,
J. Am. Chem. Soc., 1967, 89, 5043. [all data]
Wehrli and Kováts, 1959
Wehrli, A.; Kováts, E.,
Gas-chromatographische Charakterisierung ogranischer Verbindungen. Teil 3: Berechnung der Retentionsindices aliphatischer, alicyclischer und aromatischer Verbindungen,
Helv. Chim. Acta, 1959, 7, 7, 2709-2736, https://doi.org/10.1002/hlca.19590420745
. [all data]
Su, Ho, et al., 2006
Su, Y.-C.; Ho, C.-L.; Wang, E.I.-C.; Chang, S.-T.,
Antifungal activities and chemical compositions of essential oils from leaves of four eucalypts,
Taiwan J. For. Sci., 2006, 21, 1, 49-61. [all data]
Solina, Baumgartner, et al., 2005
Solina, M.; Baumgartner, P.; Johnson, R.L.; Whitfield, F.B.,
Volatile aroma components of soy protein isolate and acid-hydrolysed vegetable protein,
Food Chem., 2005, 90, 4, 861-873, https://doi.org/10.1016/j.foodchem.2004.06.005
. [all data]
Akporhonor, le Vent, et al., 1990
Akporhonor, E.E.; le Vent, S.; Taylor, D.R.,
Calculation of programmed temperature gas chromatographic characteristics from isothermal data. III. Predicted retention indices and equivalent temperatures,
J. Chromatogr., 1990, 504, 269-278, https://doi.org/10.1016/S0021-9673(01)89532-7
. [all data]
Splivallo, Bossi, et al., 2007
Splivallo, R.; Bossi, S.; Maffei, M.; Bonfante, P.,
Discrimination of truffle fruiting body versus mycelial aromas by stir bar sorptive extraction,
Phytochemistry, 2007, 68, 20, 2584-2598, https://doi.org/10.1016/j.phytochem.2007.03.030
. [all data]
Gyawali and Kim, 2012
Gyawali, R.; Kim, K.-S.,
Bioactive volatile compounds of three medicinal plants from Nepal,
Kathmandu Univ. J. Sci., Engineering and Technol., 2012, 8, 1, 51-62. [all data]
Kim. J.H., Ahn, et al., 2004
Kim. J.H.; Ahn, H.J.; Yook, H.S.; Kim, K.S.; Rhee, M.S.; Ryu, G.H.; Byun, M.W.,
Color, flavor, and sensory characteristics of gamma-irradiated salted and fermented anchovy sauce,
Radiation Phys. Chem., 2004, 69, 2, 179-187, https://doi.org/10.1016/S0969-806X(03)00400-6
. [all data]