Tricyclo[4.2.1.02,5]nona-3,7-diene
- Formula: C9H10
- Molecular weight: 118.1757
- IUPAC Standard InChIKey: KXHIYQZTTRKYGP-UHFFFAOYSA-N
- CAS Registry Number: 4932-71-2
- Chemical structure:
View 3d structure (requires JavaScript / HTML 5) - Stereoisomers:

Gas phase ion energetics data

Data compiled by: Sharon G. Lias, Rhoda D. Levin, and Sherif A. Kafafi
Ionization energy determinations
IE (eV) | Method | Reference | Comment |
---|---|---|---|
8.7 | PE | Haselbach and Eberbach, 1973 | Vertical value |

References

Haselbach and Eberbach, 1973
Haselbach, E.; Eberbach, W.,
The photolysis of tricyclo[4.2.1.02,5]nonadiene: support of a Dougherty Type N' mechanism from photoelectron spectroscopical studies,
Helv. Chim. Acta, 1973, 56, 1944. [all data]