2H-1-Benzopyran, 3,4-dihydro-
- Formula: C9H10O
- Molecular weight: 134.1751
- IUPAC Standard InChIKey: VZWXIQHBIQLMPN-UHFFFAOYSA-N
- CAS Registry Number: 493-08-3
- Chemical structure:
View 3d structure (requires JavaScript / HTML 5) - Other names: Chroman; 3,4-Dihydro-2H-1-benzopyran; Benzopyran, 3,4-dihydro; Dihydrobenzopyran

Gas phase thermochemistry data

Data compiled by: Hussein Y. Afeefy, Joel F. Liebman, and Stephen E. Stein
Quantity | Value | Units | Method | Reference | Comment |
---|---|---|---|---|---|
ΔfH°gas | -82.4 ± 1.2 | kJ/mol | Ccb | Chirico, Archer, et al., 1990 |

Condensed phase thermochemistry data

Data compiled as indicated in comments:
ALS - Hussein Y. Afeefy, Joel F. Liebman, and Stephen E. Stein
DH - Eugene S. Domalski and Elizabeth D. Hearing
Quantity | Value | Units | Method | Reference | Comment |
---|---|---|---|---|---|
ΔfH°liquid | -139.1 ± 1.2 | kJ/mol | Ccb | Chirico, Archer, et al., 1990 | ALS |
Quantity | Value | Units | Method | Reference | Comment |
ΔcH°liquid | -4831.63 ± 0.92 | kJ/mol | Ccb | Chirico, Archer, et al., 1990 | Corresponding ΔfHºliquid = -139.11 kJ/mol (simple calculation by NIST; no Washburn corrections); ALS |
Quantity | Value | Units | Method | Reference | Comment |
S°liquid | 246.018 | J/mol*K | N/A | Chirico, Archer, et al., 1990 | DH |
S°liquid | 246.03 | J/mol*K | N/A | Chirico, Nguyen, et al., 1986 | DH |
Constant pressure heat capacity of liquid
Cp,liquid (J/mol*K) | Temperature (K) | Reference | Comment |
---|---|---|---|
213.966 | 298.15 | Chirico, Archer, et al., 1990 | T = 10 to 500 K.; DH |
214.00 | 298.15 | Chirico, Nguyen, et al., 1986 | T = 10 to 450 K.; DH |

Phase change data

Data compiled as indicated in comments:
BS - Robert L. Brown and Stephen E. Stein
DH - Eugene S. Domalski and Elizabeth D. Hearing
ALS - Hussein Y. Afeefy, Joel F. Liebman, and Stephen E. Stein
DRB - Donald R. Burgess, Jr.
AC - William E. Acree, Jr., James S. Chickos
Quantity | Value | Units | Method | Reference | Comment |
---|---|---|---|---|---|
Tfus | 269.836 | K | N/A | Chirico, Nguyen, et al., 1986 | DH |
Quantity | Value | Units | Method | Reference | Comment |
ΔvapH° | 56.7 | kJ/mol | V | Chirico, Archer, et al., 1990 | ALS |
ΔvapH° | 56.7 | kJ/mol | N/A | Chirico, Archer, et al., 1990 | DRB |
Quantity | Value | Units | Method | Reference | Comment |
ΔsubH° | 56.7 ± 0.1 | kJ/mol | IPM,EB | Chirico, Archer, et al., 1990 | Based on data from 293. to 535. K.; AC |
Reduced pressure boiling point
Tboil (K) | Pressure (bar) | Reference | Comment |
---|---|---|---|
487.7 | 0.989 | Weast and Grasselli, 1989 | BS |
371.7 | 0.024 | Weast and Grasselli, 1989 | BS |
Enthalpy of sublimation
ΔsubH (kJ/mol) | Temperature (K) | Method | Reference | Comment |
---|---|---|---|---|
55.2 ± 0.1 | 320. | IPM,EB | Chirico, Archer, et al., 1990 | Based on data from 293. to 535. K.; AC |
52.7 ± 0.1 | 360. | IPM,EB | Chirico, Archer, et al., 1990 | Based on data from 293. to 535. K.; AC |
50.2 ± 0.1 | 400. | IPM,EB | Chirico, Archer, et al., 1990 | Based on data from 293. to 535. K.; AC |
48.9 ± 0.1 | 440. | IPM,EB | Chirico, Archer, et al., 1990 | Based on data from 293. to 535. K.; AC |
45.1 ± 0.3 | 480. | IPM,EB | Chirico, Archer, et al., 1990 | Based on data from 293. to 535. K.; AC |
42.5 ± 0.5 | 520. | IPM,EB | Chirico, Archer, et al., 1990 | Based on data from 293. to 535. K.; AC |
Enthalpy of fusion
ΔfusH (kJ/mol) | Temperature (K) | Reference | Comment |
---|---|---|---|
16.25537 | 269.836 | Chirico, Archer, et al., 1990 | DH |
16.26 | 269.8 | Domalski and Hearing, 1996 | AC |
Entropy of fusion
ΔfusS (J/mol*K) | Temperature (K) | Reference | Comment |
---|---|---|---|
60.242 | 269.836 | Chirico, Archer, et al., 1990 | DH |

Gas phase ion energetics data

Data compiled as indicated in comments:
LLK - Sharon G. Lias, Rhoda D. Levin, and Sherif A. Kafafi
RDSH - Henry M. Rosenstock, Keith Draxl, Bruce W. Steiner, and John T. Herron
Ionization energy determinations
IE (eV) | Method | Reference | Comment |
---|---|---|---|
7.93 | PE | Behan, Dean, et al., 1976 | LLK |
8.43 | EI | Loudon, Maccoll, et al., 1970 | RDSH |

References

Chirico, Archer, et al., 1990
Chirico, R.D.; Archer, D.G.; Hossenlopp, I.A.; Nguyen, A.; Steele, W.V.; Gammon, B.E.,
The thermodynamic properties of chroman and isochroman,
J. Chem. Thermodyn., 1990, 22, 665-682. [all data]
Chirico, Nguyen, et al., 1986
Chirico, R.D.; Nguyen, A.; Steele, W.V.; Strube, M.M.; Hossenlopp, I.A.; Gammon, B.E.,
Thermochemical and thermophysical properties of organic compounds derived from fossil substances. Chemical thermodynamic properties of organic oxygen compounds found in fossil materials,
NIPER Report, 1986, 135, 42p. [all data]
Weast and Grasselli, 1989
CRC Handbook of Data on Organic Compounds, 2nd Editon, Weast,R.C and Grasselli, J.G., ed(s)., CRC Press, Inc., Boca Raton, FL, 1989, 1. [all data]
Domalski and Hearing, 1996
Domalski, Eugene S.; Hearing, Elizabeth D.,
Heat Capacities and Entropies of Organic Compounds in the Condensed Phase. Volume III,
J. Phys. Chem. Ref. Data, 1996, 25, 1, 1, https://doi.org/10.1063/1.555985
. [all data]
Behan, Dean, et al., 1976
Behan, J.M.; Dean, F.M.; Johnstone, R.A.W.,
Photoelectron spectra of cyclic aromatic ethers. The question of the Mills-Nixon effect,
Tetrahedron, 1976, 32, 167. [all data]
Loudon, Maccoll, et al., 1970
Loudon, A.G.; Maccoll, A.; Wong, S.K.,
Comparison between unimolecular gas phase pyrolysis and electron impact fragmentation. Part I. The mass spectra of tetralin and some related heterocycles,
J. Chem. Soc. B, 1970, 1727. [all data]