Bicyclo[3.2.0]hept-6-ene
- Formula: C7H10
- Molecular weight: 94.1543
- IUPAC Standard InChIKey: LMULYBMQCQUKHQ-UHFFFAOYSA-N
- CAS Registry Number: 4927-03-1
- Chemical structure:
View 3d structure (requires JavaScript / HTML 5) - Permanent link for this species. Use this link for bookmarking this species for future reference.

Gas phase thermochemistry data

Data compiled by: Hussein Y. Afeefy, Joel F. Liebman, and Stephen E. Stein
Quantity | Value | Units | Method | Reference | Comment |
---|---|---|---|---|---|
ΔfH°gas | 139.7 | kJ/mol | Chyd | Roth, Adamczak, et al., 1991 |

Gas phase ion energetics data

Data compiled as indicated in comments:
RDSH - Henry M. Rosenstock, Keith Draxl, Bruce W. Steiner, and John T. Herron
Ionization energy determinations
IE (eV) | Method | Reference | Comment |
---|---|---|---|
9.37 | EI | Lifshitz and Bauer, 1963 | RDSH |
Appearance energy determinations
Ion | AE (eV) | Other Products | Method | Reference | Comment |
---|---|---|---|---|---|
C5H6+ | 10.15 | ? | EI | Lifshitz and Bauer, 1963 | RDSH |
C6H7+ | 9.8 | CH3 | EI | Harrison, Haynes, et al., 1965 | RDSH |
C7H8+ | 9.4 | H2 | EI | Lifshitz and Bauer, 1963 | RDSH |
C7H9+ | 10.7 | H | EI | Harrison, Haynes, et al., 1965 | RDSH |
C7H9+ | 10.67 | H | EI | Lifshitz and Bauer, 1963 | RDSH |

Normal alkane RI, non-polar column, temperature ramp

Column type | Active phase | I | Reference | Comment |
---|---|---|---|---|
Capillary | DB-5 | 1014. | Lawal and Oyedelji, 2009 | 30. m/0.25 mm/0.25 μm, Helium, 5. K/min; Tstart: 70. C; Tend: 240. C |

References

Roth, Adamczak, et al., 1991
Roth, W.R.; Adamczak, O.; Breuckmann, R.; Lennartz, H.-W.; Boese, R.,
Die Berechnung von Resonanzenergien; das MM2ERW-Kraftfeld,
Chem. Ber., 1991, 124, 2499-2521. [all data]
Lifshitz and Bauer, 1963
Lifshitz, C.; Bauer, S.H.,
Mass spectra of valence tautomers,
J. Phys. Chem., 1963, 67, 1629. [all data]
Harrison, Haynes, et al., 1965
Harrison, A.G.; Haynes, P.; McLean, S.; Meyer, F.,
The mass spectra of methyl-substituted cyclopentadienes,
J. Am. Chem. Soc., 1965, 87, 5099. [all data]
Lawal and Oyedelji, 2009
Lawal, O.A.; Oyedelji, A.O.,
Chemical composition of the essential oils of Cyperus rotundus L. from South Africa,
Molecules, 2009, 14, 8, 2909-2917, https://doi.org/10.3390/molecules14082909
. [all data]