Benzeneacetic acid, 4-ethoxy-
- Formula: C10H12O3
- Molecular weight: 180.2005
- IUPAC Standard InChIKey: ZVVWZNFSMIFGEP-UHFFFAOYSA-N
- CAS Registry Number: 4919-33-9
- Chemical structure:
View 3d structure (requires JavaScript / HTML 5) - Other names: para-Ethoxyphenylacetic acid; 4-Ethoxyphenylacetic acid; p-Ethoxyphenylacetic acid

Phase change data

Data compiled as indicated in comments:
TRC - Thermodynamics Research Center, NIST Boulder Laboratories, Chris Muzny director
AC - William E. Acree, Jr., James S. Chickos
Quantity | Value | Units | Method | Reference | Comment |
---|---|---|---|---|---|
Tfus | 360. | K | N/A | Armstrong, James, et al., 1979 | Uncertainty assigned by TRC = 0.5 K; TRC |
Enthalpy of fusion
ΔfusH (kJ/mol) | Temperature (K) | Reference | Comment |
---|---|---|---|
23.0 | 360.2 | Acree, 1991 | AC |

References

Armstrong, James, et al., 1979
Armstrong, N.A.; James, K.C.; Wong, C.K.,
Inter-relationships between solubilities, distribution coefficients and melting points of some substituted benzoic and phenylacetic acids,
J. Pharm. Pharmacol., 1979, 31, 1, 627, https://doi.org/10.1111/j.2042-7158.1979.tb13606.x
. [all data]
Acree, 1991
Acree, William E.,
Thermodynamic properties of organic compounds: enthalpy of fusion and melting point temperature compilation,
Thermochimica Acta, 1991, 189, 1, 37-56, https://doi.org/10.1016/0040-6031(91)87098-H
. [all data]