Benzenamine, N,N,3,5-tetramethyl-
- Formula: C10H15N
- Molecular weight: 149.2328
- IUPAC Standard InChIKey: NBFRQCOZERNGEX-UHFFFAOYSA-N
- CAS Registry Number: 4913-13-7
- Chemical structure:
View 3d structure (requires JavaScript / HTML 5) - Other names: 3,5-Xylidine, N,N-dimethyl-; N,N-Dimethyl-sym-m-xylidine; N,N,3,5-Tetramethylaniline; N,N-3,5-Tetramethylbenzenamine; N,N-dimethyl-3,5-xylidine

Phase change data

Data compiled by: Robert L. Brown and Stephen E. Stein
Quantity | Value | Units | Method | Reference | Comment |
---|---|---|---|---|---|
Tboil | 500.2 | K | N/A | Aldrich Chemical Company Inc., 1990 |
Reduced pressure boiling point
Tboil (K) | Pressure (bar) | Reference |
---|---|---|
408. to 410. | 0.033 | Frinton Laboratories Inc., 1986 |

Gas phase ion energetics data

Data evaluated as indicated in comments:
HL - Edward P. Hunter and Sharon G. Lias
Data compiled as indicated in comments:
LBLHLM - Sharon G. Lias, John E. Bartmess, Joel F. Liebman, John L. Holmes, Rhoda D. Levin, and W. Gary Mallard
RDSH - Henry M. Rosenstock, Keith Draxl, Bruce W. Steiner, and John T. Herron
Quantity | Value | Units | Method | Reference | Comment |
---|---|---|---|---|---|
Proton affinity (review) | 956.1 | kJ/mol | N/A | Hunter and Lias, 1998 | HL |
Quantity | Value | Units | Method | Reference | Comment |
Gas basicity | 924.3 | kJ/mol | N/A | Hunter and Lias, 1998 | HL |
Ionization energy determinations
IE (eV) | Method | Reference | Comment |
---|---|---|---|
6.95 | EQ | Lias, Jackson, et al., 1985 | LBLHLM |
7.25 | CTS | Farrell and Newton, 1965 | RDSH |

References

Aldrich Chemical Company Inc., 1990
Aldrich Chemical Company Inc.,
Catalog Handbook of Fine Chemicals, Aldrich Chemical Company, Inc., Milwaukee WI, 1990, 1. [all data]
Frinton Laboratories Inc., 1986
Frinton Laboratories Inc.,
Catalog Number 11, Frinton Laboratories Inc., Vineland, NJ, 1986, 99. [all data]
Hunter and Lias, 1998
Hunter, E.P.; Lias, S.G.,
Evaluated Gas Phase Basicities and Proton Affinities of Molecules: An Update,
J. Phys. Chem. Ref. Data, 1998, 27, 3, 413-656, https://doi.org/10.1063/1.556018
. [all data]
Lias, Jackson, et al., 1985
Lias, S.G.; Jackson, J.-A.A.; Argentar, H.; Liebman, J.F.,
Substituted N,N-dialkylanilines: Relative ionization energies and proton affinities through determinations of ion-molecule reaction equilibrium constants,
J. Org. Chem., 1985, 50, 333. [all data]
Farrell and Newton, 1965
Farrell, P.G.; Newton, J.,
Ionization potentials of aromatic amines,
J. Phys. Chem., 1965, 69, 3506. [all data]