2-Pentanol, 2,3-dimethyl-
- Formula: C7H16O
- Molecular weight: 116.2013
- IUPAC Standard InChIKey: YRSIFCHKXFKNME-UHFFFAOYSA-N
- CAS Registry Number: 4911-70-0
- Chemical structure:
View 3d structure (requires JavaScript / HTML 5) - Species with the same structure:
- Other names: 2,3-Dimethyl-2-pentanol; 2,3-dimethylpentan-2-ol

Phase change data

Data compiled by: Thermodynamics Research Center, NIST Boulder Laboratories, Chris Muzny director
Quantity | Value | Units | Method | Reference | Comment |
---|---|---|---|---|---|
Tboil | 410.65 | K | N/A | Schmerling and Meisinger, 1953 | Uncertainty assigned by TRC = 3. K |
Tboil | 412.05 | K | N/A | Pichler, Ziesecke, et al., 1950 | Uncertainty assigned by TRC = 2. K |
Tboil | 412.15 | K | N/A | Ginnings and Hauser, 1938 | Uncertainty assigned by TRC = 3. K |
Tboil | 402.9 | K | N/A | Edgar, Calingaert, et al., 1929 | Uncertainty assigned by TRC = 2. K |

Gas phase ion energetics data

Data compiled by: Sharon G. Lias and Joel F. Liebman
Appearance energy determinations
Ion | AE (eV) | Other Products | Method | Reference | Comment |
---|---|---|---|---|---|
C3H7O+ | 9.68 | 2-C4H9 | EI | Holmes, Lossing, et al., 1988 |

References

Schmerling and Meisinger, 1953
Schmerling, L.; Meisinger, E.E.,
Condensation of Saturated Halides with Unsaturated Compounds X. Condensation of t-Butyl Halides with Propene, 1-Butene and 2-Butene,
J. Am. Chem. Soc., 1953, 75, 6217. [all data]
Pichler, Ziesecke, et al., 1950
Pichler, H.; Ziesecke, K.H.; Traeger, B.,
The Oxygen-containing Compounds, Especially Alcohols, Formed in Isosynthesis,
Brennst.-Chem., 1950, 31, 361. [all data]
Ginnings and Hauser, 1938
Ginnings, P.M.; Hauser, M.,
Aqueous solubilities of some isomeric heptanols,
J. Am. Chem. Soc., 1938, 60, 2581-2582. [all data]
Edgar, Calingaert, et al., 1929
Edgar, G.; Calingaert, G.; Marker, R.E.,
Preparation and Properties of the Isomeric Heptanes I. Preparation Preparation.,
J. Am. Chem. Soc., 1929, 51, 1483. [all data]
Holmes, Lossing, et al., 1988
Holmes, J.L.; Lossing, F.P.; Maccoll, A.,
Heats of formation of alkyl radicals from appearance energies,
J. Am. Chem. Soc., 1988, 110, 7339. [all data]