3-Hexyne, 2,2-dimethyl-
- Formula: C8H14
- Molecular weight: 110.1968
- IUPAC Standard InChIKey: XYBFBXTUWDPXLK-UHFFFAOYSA-N
- CAS Registry Number: 4911-60-8
- Chemical structure:
View 3d structure (requires JavaScript / HTML 5) - Permanent link for this species. Use this link for bookmarking this species for future reference.

Gas phase ion energetics data

Data compiled by: Sharon G. Lias, Rhoda D. Levin, and Sherif A. Kafafi
Ionization energy determinations
IE (eV) | Method | Reference |
---|---|---|
9.180 ± 0.010 | PE | Carlier, Dubois, et al., 1975 |

Kovats' RI, non-polar column, isothermal

Column type | Active phase | Temperature (C) | I | Reference | Comment |
---|---|---|---|---|---|
Capillary | Squalane | 80. | 675. | Soják, Farkas, et al., 1991 | 107. m/0.25 mm/0.40 μm, H2 |

References

Carlier, Dubois, et al., 1975
Carlier, P.; Dubois, J.E.; Masclet, P.; Mouvier, G.,
Spectres de photoelectrons des alcynes,
J. Electron Spectrosc. Relat. Phenom., 1975, 7, 55. [all data]