1,3-Pentadiyne
- Formula: C5H4
- Molecular weight: 64.0853
- IUPAC Standard InChIKey: VNMDYSSJFJFEQI-UHFFFAOYSA-N
- CAS Registry Number: 4911-55-1
- Chemical structure:
View 3d structure (requires JavaScript / HTML 5) - Permanent link for this species. Use this link for bookmarking this species for future reference.

Phase change data

Data compiled as indicated in comments:
BS - Robert L. Brown and Stephen E. Stein
TRC - Thermodynamics Research Center, NIST Boulder Laboratories, Chris Muzny director
Quantity | Value | Units | Method | Reference | Comment |
---|---|---|---|---|---|
Tboil | 328.7 | K | N/A | Weast and Grasselli, 1989 | BS |
Tboil | 328. | K | N/A | Prevost, 1929 | Uncertainty assigned by TRC = 4. K; TRC |

Gas phase ion energetics data

Data compiled as indicated in comments:
LLK - Sharon G. Lias, Rhoda D. Levin, and Sherif A. Kafafi
LL - Sharon G. Lias and Joel F. Liebman
Ionization energy determinations
IE (eV) | Method | Reference | Comment |
---|---|---|---|
9.50 ± 0.02 | PE | Maier, 1981 | LLK |
9.4 | PIPECO | Forster, Maier, et al., 1981 | LLK |
9.51 | PE | Dannacher, Heilbronner, et al., 1979 | LLK |
9.51 | PE | Brogli, Heilbronner, et al., 1973 | LLK |
9.5 ± 0.1 | PE | Bieri, Burger, et al., 1977 | Vertical value; LLK |
Appearance energy determinations
Ion | AE (eV) | Other Products | Method | Reference | Comment |
---|---|---|---|---|---|
C3H2+ | 12.3 | C2H2 | PI | Dannacher, Heilbronner, et al., 1979 | LLK |
C5H2+ | 13.7 | H2 | EI | Dannacher, Heilbronner, et al., 1979 | LLK |
C5H3+ | 11.66 ± 0.02 | H | PI | Kompe, Peel, et al., 1993 | LL |
C5H3+ | 11.6 ± 0.2 | H | EI | Dannacher, Heilbronner, et al., 1979 | LLK |

Gas phase thermochemistry data

Data compiled by: Glushko Thermocenter, Russian Academy of Sciences, Moscow
Constant pressure heat capacity of gas
Cp,gas (J/mol*K) | Temperature (K) | Reference | Comment |
---|---|---|---|
49.79 | 100. | Benestad L., 1975 | |
72.22 | 200. | ||
86.44 | 273.15 | ||
90.79 | 298.15 | ||
91.13 | 300. | ||
106.48 | 400. | ||
119.20 | 500. | ||
129.87 | 600. |

References

Weast and Grasselli, 1989
CRC Handbook of Data on Organic Compounds, 2nd Editon, Weast,R.C and Grasselli, J.G., ed(s)., CRC Press, Inc., Boca Raton, FL, 1989, 1. [all data]
Prevost, 1929
Prevost, C.,
Ann. Chim., 1929, 10, 113. [all data]
Maier, 1981
Maier, J.P.,
Structure and decay of gaseous organic radical cations studied by their radiative decay, exemplified by the 1,3-pentadiyne cation,
Angew. Chem. Int. Ed. Engl., 1981, 20, 638. [all data]
Forster, Maier, et al., 1981
Forster, P.; Maier, J.P.; Thommen, F.,
Radiative and non-radiative decay rates of alkyl substituted diacetylene cations at selected energies within their 2A states determined via photoelectron-photoion coincidence measurements,
Chem. Phys., 1981, 59, 85. [all data]
Dannacher, Heilbronner, et al., 1979
Dannacher, J.; Heilbronner, E.; Stadelmann, J.-P.; Vogt, J.,
225. Fragmentation of energy selected butadiyne and 1,3-pentadiyne radical cations,
Helv. Chim. Acta, 1979, 62, 2186. [all data]
Brogli, Heilbronner, et al., 1973
Brogli, F.; Heilbronner, E.; Hornung, V.; Kloster-Jensen, E.,
230. Die photoelektronen-spektren methyl-substituierter Acetylene,
Helv. Chim. Acta, 1973, 56, 2171. [all data]
Bieri, Burger, et al., 1977
Bieri, G.; Burger, F.; Heilbronner, E.; Maier, J.P.,
Valence ionization enrgies of hydrocarbons,
Helv. Chim. Acta, 1977, 60, 2213. [all data]
Kompe, Peel, et al., 1993
Kompe, B.; Peel, J.B.; Traeger, J.C.,
A theoretical and experimental study of the structures and stabilities of the [C5H3]+ cation,
Org. Mass Spectrom., 1993, 28, 1253. [all data]