7H-Benzocyclohepten-7-one,6-methyl-
- Formula: C12H10O
- Molecular weight: 170.2072
- IUPAC Standard InChIKey: DVPSDPRLPHEFDN-UHFFFAOYSA-N
- CAS Registry Number: 4900-73-6
- Chemical structure:
View 3d structure (requires JavaScript / HTML 5) - Permanent link for this species. Use this link for bookmarking this species for future reference.

Gas phase ion energetics data

Data compiled by: Sharon G. Lias, Rhoda D. Levin, and Sherif A. Kafafi
Ionization energy determinations
IE (eV) | Method | Reference | Comment |
---|---|---|---|
8.46 ± 0.03 | PE | Allan, Heilbronner, et al., 1975 | Vertical value |

References

Allan, Heilbronner, et al., 1975
Allan, M.; Heilbronner, E.; Kloster-Jensen, E.,
A photoelectron-spectroscopic investigation of benzologue tropones,
J. Electron Spectrosc. Relat. Phenom., 1975, 6, 181. [all data]