1,8-Nonadiene
- Formula: C9H16
- Molecular weight: 124.2233
- IUPAC Standard InChIKey: VJHGSLHHMIELQD-UHFFFAOYSA-N
- CAS Registry Number: 4900-30-5
- Chemical structure:
View 3d structure (requires JavaScript / HTML 5) - Other names: nona-1,8-diene

Phase change data

Data compiled as indicated in comments:
BS - Robert L. Brown and Stephen E. Stein
TRC - Thermodynamics Research Center, NIST Boulder Laboratories, Chris Muzny director
Quantity | Value | Units | Method | Reference | Comment |
---|---|---|---|---|---|
Tboil | 415.7 | K | N/A | Weast and Grasselli, 1989 | BS |
Tboil | 415. | K | N/A | Marvel and Garrison, 1959 | Uncertainty assigned by TRC = 2. K; TRC |
Tboil | 413. | K | N/A | Everet and Kon, 1950 | Uncertainty assigned by TRC = 2. K; TRC |
Tboil | 416. | K | N/A | Van Pelt and Wibaut, 1941 | Uncertainty assigned by TRC = 4. K; TRC |

Gas phase ion energetics data

Data compiled by: Sharon G. Lias, Rhoda D. Levin, and Sherif A. Kafafi
Ionization energy determinations
IE (eV) | Method | Reference | Comment |
---|---|---|---|
9.51 ± 0.02 | PE | Bunzli, Burak, et al., 1973 | Vertical value |

Kovats' RI, non-polar column, isothermal

Column type | Active phase | Temperature (C) | I | Reference | Comment |
---|---|---|---|---|---|
Capillary | Squalane | 70. | 862.7 | Soják, Král'ovicová, et al., 1984 | 195. m/0.25 mm/0.08 μm, H2 |

Van Den Dool and Kratz RI, non-polar column, temperature ramp

Column type | Active phase | I | Reference | Comment |
---|---|---|---|---|
Capillary | Petrocol DH | 876. | White, Hackett, et al., 1992 | 100. m/0.25 mm/0.5 μm, He, 1. K/min; Tstart: 30. C; Tend: 220. C |

Normal alkane RI, non-polar column, temperature ramp

Column type | Active phase | I | Reference | Comment |
---|---|---|---|---|
Capillary | Ultra-ALLOY-5 | 882. | Tsuge, Ohtan, et al., 2011 | 30. m/0.25 mm/0.25 μm, 40. C @ 2. min, 20. K/min, 320. C @ 13. min |
Capillary | Ultra-ALLOY-5 | 883. | Tsuge, Ohtan, et al., 2011 | 30. m/0.25 mm/0.25 μm, 40. C @ 2. min, 20. K/min, 320. C @ 13. min |

Normal alkane RI, non-polar column, custom temperature program

Column type | Active phase | I | Reference | Comment |
---|---|---|---|---|
Capillary | DB-5 MS | 892. | Luo and Agnew, 2001 | 30. m/0.25 mm/1.0 μm, Helium; Program: not specified |

References

Weast and Grasselli, 1989
CRC Handbook of Data on Organic Compounds, 2nd Editon, Weast,R.C and Grasselli, J.G., ed(s)., CRC Press, Inc., Boca Raton, FL, 1989, 1. [all data]
Marvel and Garrison, 1959
Marvel, C.S.; Garrison, W.E.,
Polymerization of Higher a.pha.-Olefins eith Metal ALkyl Coordination Catalysts,
J. Am. Chem. Soc., 1959, 81, 4737-44. [all data]
Everet and Kon, 1950
Everet, J.L.; Kon, G.A.R.,
J. Chem. Soc., 1950, 1950, 3131. [all data]
Van Pelt and Wibaut, 1941
Van Pelt, A.J.; Wibaut, J.P.,
The preparation of unsaturated hydrocarbons by the thermal decomposition of acetates.,
Recl. Trav. Chim. Pays-Bas, 1941, 60, 55. [all data]
Bunzli, Burak, et al., 1973
Bunzli, J.C.; Burak, A.J.; Frost, D.C.,
Through-space interaction in non-conjugated acyclic dienes studied by photoelectron spectroscopy,
Tetrahedron, 1973, 29, 3735. [all data]
Soják, Král'ovicová, et al., 1984
Soják, L.; Král'ovicová, E.; Ostrovský, I.; Leclercq, P.A.,
Retention behaviour of conjegated and isolated n-alkadienes. Identification of n-nona- and n-decadiens by capillary gas chromatography using structure-retention correlations and mass spectrometry,
J. Chromatogr., 1984, 292, 1, 241-261, https://doi.org/10.1016/S0021-9673(01)96207-7
. [all data]
White, Hackett, et al., 1992
White, C.M.; Hackett, J.; Anderson, R.R.; Kail, S.; Spock, P.S.,
Linear temperature programmed retention indices of gasoline range hydrocarbons and chlorinated hydrocarbons on cross-linked polydimethylsiloxane,
J. Hi. Res. Chromatogr., 1992, 15, 2, 105-120, https://doi.org/10.1002/jhrc.1240150211
. [all data]
Tsuge, Ohtan, et al., 2011
Tsuge, S.; Ohtan, H.; Watanabe, C.,
Pyrolysis - GC/MS Data Book of Synthetic Polymers, Elsevier, 2011, 420. [all data]
Luo and Agnew, 2001
Luo, J.; Agnew, M.P.,
Gas characteristics before and after biofiltration treating odorous emissions from animal rendering processes,
Environ. Technol., 2001, 22, 9, 1091-1103, https://doi.org/10.1080/09593332208618220
. [all data]