Benzene, 1-methyl-3-(methylthio)-
- Formula: C8H10S
- Molecular weight: 138.230
- IUPAC Standard InChIKey: HCQVSQDSAZSABA-UHFFFAOYSA-N
- CAS Registry Number: 4886-77-5
- Chemical structure:
View 3d structure (requires JavaScript / HTML 5) - Other names: Sulfide, methyl m-tolyl; m-Methylthioanisole; Methyl m-tolyl sulfide; 3-Methylthiotoluene; 3-Methylbenzenethiol, S-methyl-; 1-Methyl-3-(methylsulfanyl)benzene

Gas phase ion energetics data

Data compiled as indicated in comments:
LLK - Sharon G. Lias, Rhoda D. Levin, and Sherif A. Kafafi
Ionization energy determinations
IE (eV) | Method | Reference | Comment |
---|---|---|---|
8.00 | PE | Dewar, Ernstbrunner, et al., 1974 | Vertical value; LLK |
8.50 | PE | Dewar, Ernstbrunner, et al., 1974 | Vertical value; LLK |

Van Den Dool and Kratz RI, non-polar column, custom temperature program

Column type | Active phase | I | Reference | Comment |
---|---|---|---|---|
Capillary | VF-5MS | 1213. | Tret'yakov, 2008 | 30. m/0.25 mm/0.25 μm, He; Program: Multi-step temperature program; T(initial)=60C; T(final)=270C |

References

Dewar, Ernstbrunner, et al., 1974
Dewar, P.S.; Ernstbrunner, E.; Gilmore, J.R.; Godfrey, M.; Mellor, J.M.,
Conformational analysis of alkyl aryl ethers and alkyl aryl sulphides by photoelectron spectroscopy,
Tetrahedron, 1974, 30, 2455. [all data]
Tret'yakov, 2008
Tret'yakov, K.V.,
Retention Data. NIST Mass Spectrometry Data Center., NIST Mass Spectrometry Data Center, 2008. [all data]