2-Cyclopropen-1-one, 2-methyl-
- Formula: C4H4O
- Molecular weight: 68.0740
- IUPAC Standard InChIKey: RPXKJTRXDSLNMW-UHFFFAOYSA-N
- CAS Registry Number: 4883-96-9
- Chemical structure:
View 3d structure (requires JavaScript / HTML 5) - Permanent link for this species. Use this link for bookmarking this species for future reference.

Gas phase ion energetics data

Data compiled as indicated in comments:
LLK - Sharon G. Lias, Rhoda D. Levin, and Sherif A. Kafafi
Ionization energy determinations
IE (eV) | Method | Reference | Comment |
---|---|---|---|
9.15 ± 0.05 | EI | Holmes and Terlouw, 1979 | LLK |
9.15 ± 0.05 | PE | Holmes, Terlouw, et al., 1979 | LLK |

References

Holmes and Terlouw, 1979
Holmes, J.L.; Terlouw, J.K.,
Structures of [C4H4O]+ ions produced from 2- and 4-pyrone,
J. Am. Chem. Soc., 1979, 101, 4973. [all data]
Holmes, Terlouw, et al., 1979
Holmes, J.L.; Terlouw, J.K.; Vijfhuizen, P.C.; A'Campo, C.,
Metastable ion studies XII-Molecular and fragment ion structures for isomeric C4H6O2 acids,
Org. Mass Spectrom., 1979, 14, 204. [all data]