Lumazine
- Formula: C6H4N4O2
- Molecular weight: 164.1216
- IUPAC Standard InChIKey: UYEUUXMDVNYCAM-UHFFFAOYSA-N
- CAS Registry Number: 487-21-8
- Chemical structure:
View 3d structure (requires JavaScript / HTML 5) - Other names: 2,4(1H,3H)-Pteridinedione; 2,4(3H,8H)-Pteridinedione; 2,4-Dihydroxypteridine; 2,4-Pteridinediol; Lumazin; Pteridinedione, 2,4(1h,3h)-; pteridine-2,4-diol monohydrate

Gas phase ion energetics data

Data compiled by: Sharon G. Lias, Rhoda D. Levin, and Sherif A. Kafafi
Ionization energy determinations
IE (eV) | Method | Reference | Comment |
---|---|---|---|
9.20 | PE | Palmer, Simpson, et al., 1980 | Vertical value |

References

Palmer, Simpson, et al., 1980
Palmer, M.H.; Simpson, I.; Platenkamp, R.J.,
The electronic structure of flavin derivatives,
J. Mol. Struct., 1980, 66, 243. [all data]