(E)-1,3-Hexadiene, 4-methyl-
- Formula: C7H12
- Molecular weight: 96.1702
- IUPAC Standard InChIKey: AGDLFOKHPDHOPH-VOTSOKGWSA-N
- CAS Registry Number: 4842-93-7
- Chemical structure:
View 3d structure (requires JavaScript / HTML 5) - Species with the same structure:

Gas phase ion energetics data

Data compiled by: Sharon G. Lias, Rhoda D. Levin, and Sherif A. Kafafi
Ionization energy determinations
IE (eV) | Method | Reference | Comment |
---|---|---|---|
8.19 | PE | Masclet, Mouvier, et al., 1981 | Vertical value |

References

Masclet, Mouvier, et al., 1981
Masclet, P.; Mouvier, G.; Bocquet, J.F.,
Effets electroniques et effets steriques dus a la substitution alcoyle dans les dienes conjugues,
J. Chim. Phys., 1981, 78, 99. [all data]