2-Hexanone, 1,1,1,3,3-d5-
- Formula: C6H7D5O
- Molecular weight: 105.1897
- IUPAC Standard InChIKey: QQZOPKMRPOGIEB-ZTIZGVCASA-N
- CAS Registry Number: 4840-82-8
- Chemical structure:
View 3d structure (requires JavaScript / HTML 5) - Isotopologues:

Gas phase ion energetics data

Data compiled by: Henry M. Rosenstock, Keith Draxl, Bruce W. Steiner, and John T. Herron
Appearance energy determinations
Ion | AE (eV) | Other Products | Method | Reference | Comment |
---|---|---|---|---|---|
C2D3O+ | 12.2 ± 0.2 | ? | EI | McLafferty, McAdoo, et al., 1969 | |
C3HD5O+ | 10.4 ± 0.2 | C3H6 | EI | McLafferty, McAdoo, et al., 1969 | |
C4H2D5O+ | 10.9 ± 0.2 | C2H5 | EI | McLafferty, McAdoo, et al., 1969 | |
C5H4D5O+ | 9.5 ± 0.2 | CH3 | EI | McLafferty, McAdoo, et al., 1969 | |
C5H7D2O+ | 10.2 ± 0.2 | CD3 | EI | McLafferty, McAdoo, et al., 1969 |

References

McLafferty, McAdoo, et al., 1969
McLafferty, F.W.; McAdoo, D.J.; Smith, J.S.,
Unimolecular gaseous ion reactions of low activation energy. Five-membered-ring formation,
J. Am. Chem. Soc., 1969, 91, 5400. [all data]