2-Pentanone, 4-methyl-1,1,1,3,3-d5-
- Formula: C6H7D5O
- Molecular weight: 105.1897
- IUPAC Standard InChIKey: NTIZESTWPVYFNL-IKISXXDZSA-N
- CAS Registry Number: 4840-81-7
- Chemical structure:
View 3d structure (requires JavaScript / HTML 5) - Isotopologues:

Gas phase ion energetics data

Data compiled by: Henry M. Rosenstock, Keith Draxl, Bruce W. Steiner, and John T. Herron
Ionization energy determinations
IE (eV) | Method | Reference |
---|---|---|
9.35 | EI | Hatada and Hirota, 1965 |

References

Hatada and Hirota, 1965
Hatada, M.; Hirota, K.,
The ionization and dissociation of methyl butyl ketones under electron impact. I. Methyl n-butyl ketone and methyl isobutyl ketone,
Bull. Chem. Soc. Japan, 1965, 38, 599. [all data]