Benzeneethanamine,3,4,5-trimethoxy-N-methyl-
- Formula: C12H19NO3
- Molecular weight: 225.2842
- IUPAC Standard InChIKey: OTXANOLOOUNVSR-UHFFFAOYSA-N
- CAS Registry Number: 4838-96-4
- Chemical structure:
View 3d structure (requires JavaScript / HTML 5) - Other names: Benzenethanamine,3,4,5-trimethoxy-N-methyl-; Mescaline, N-methyl-; N-Methylmescaline

Gas phase ion energetics data

Data compiled as indicated in comments:
LLK - Sharon G. Lias, Rhoda D. Levin, and Sherif A. Kafafi
Appearance energy determinations
Ion | AE (eV) | Other Products | Method | Reference | Comment |
---|---|---|---|---|---|
C12H19NO3+ | 8.44 ± 0.40 | ? | PE | Domelsmith, Munchausen, et al., 1977 | Vertical value; LLK |

Normal alkane RI, non-polar column, custom temperature program

Column type | Active phase | I | Reference | Comment |
---|---|---|---|---|
Other | Methyl Silicone | 1700. | Ardrey and Moffat, 1981 | Program: not specified |

References

Domelsmith, Munchausen, et al., 1977
Domelsmith, L.N.; Munchausen, L.L.; Houk, K.N.,
Photoelectron spectra of psychotropic drugs. 1. Phenethylamines, tryptamines, and LSD,
J. Am. Chem. Soc., 1977, 99, 4311. [all data]
Ardrey and Moffat, 1981
Ardrey, R.E.; Moffat, A.C.,
Gas-liquid chromatographic retention indices of 1318 substances of toxicological interest on SE-30 or OV-1 stationary phase,
J. Chromatogr., 1981, 220, 3, 195-252, https://doi.org/10.1016/S0021-9673(00)81925-1
. [all data]