4-Tert-butylphenyl propargyl ether
- Formula: C13H16O
- Molecular weight: 188.2655
- IUPAC Standard InChIKey: LCKMFILTJDWOQW-UHFFFAOYSA-N
- CAS Registry Number: 48144-15-6
- Chemical structure:
View 3d structure (requires JavaScript / HTML 5) - Other names: Benzene, 1-(1,1-dimethylethyl)-4-(2-propynyloxy)-

Gas phase ion energetics data

Data compiled as indicated in comments:
LBLHLM - Sharon G. Lias, John E. Bartmess, Joel F. Liebman, John L. Holmes, Rhoda D. Levin, and W. Gary Mallard
Ionization energy determinations
IE (eV) | Method | Reference | Comment |
---|---|---|---|
7.85 ± 0.02 | EI | Orlov, Misharev, et al., 1986 | LBLHLM |
Appearance energy determinations
Ion | AE (eV) | Other Products | Method | Reference | Comment |
---|---|---|---|---|---|
C12H13O+ | 9.6 ± 0.1 | CH3 | EI | Orlov, Misharev, et al., 1986 | LBLHLM |

References

Orlov, Misharev, et al., 1986
Orlov, V.; Misharev, A.; Takhistox, V.,
Determination of the enthalpy of formation of para-substituted α,α-dimethyl cations in the gas phase,
Izv. Akad. Nauk SSSR Ser. Khim., 1986, 9, 2006. [all data]