Cyclobutane, propyl-
- Formula: C7H14
- Molecular weight: 98.1861
- IUPAC Standard InChIKey: GAGITJRONXSBFC-UHFFFAOYSA-N
- CAS Registry Number: 4806-62-6
- Chemical structure:
View 3d structure (requires JavaScript / HTML 5) - Permanent link for this species. Use this link for bookmarking this species for future reference.

Gas phase ion energetics data

Data compiled by: Sharon G. Lias and Joel F. Liebman
Ionization energy determinations
IE (eV) | Method | Reference |
---|---|---|
10. ± 0.1 | EI | Haib and Stahl, 1990 |

References

Haib and Stahl, 1990
Haib, J.; Stahl, D.,
The loss of water from ionized heptanols in the gas phase,
Org. Mass Spectrom., 1990, 25, 592. [all data]