Julolidine
- Formula: C12H15N
- Molecular weight: 173.2542
- IUPAC Standard InChIKey: DZFWNZJKBJOGFQ-UHFFFAOYSA-N
- CAS Registry Number: 479-59-4
- Chemical structure:
View 3d structure (requires JavaScript / HTML 5) - Other names: 1H,5H-Benzo[ij]quinolizine, 2,3,6,7-tetrahydro-; 2,3,6,7-Tetrahydro-1H,5H-benzo(ij)quinolizine

Gas phase ion energetics data

Data compiled by: Sharon G. Lias, Rhoda D. Levin, and Sherif A. Kafafi
Ionization energy determinations
IE (eV) | Method | Reference |
---|---|---|
6.65 ± 0.02 | PE | Maier and Turner, 1973 |

References

Maier and Turner, 1973
Maier, J.P.; Turner, D.W.,
Steric inhibition of resonance studied by molecular photoelectron spectroscopy Part 3. Anilines, Phenols and Related Compounds,
J. Chem. Soc. Faraday Trans. 2, 1973, 69, 521. [all data]