Tetryl
- Formula: C7H5N5O8
- Molecular weight: 287.1433
- IUPAC Standard InChIKey: AGUIVNYEYSCPNI-UHFFFAOYSA-N
- CAS Registry Number: 479-45-8
- Chemical structure:
View 3d structure (requires JavaScript / HTML 5) - Other names: N-Methyl-N,2,4,6-tetranitroaniline; Benzenamine, N-methyl-N,2,4,6-tetranitro-; Aniline, N-methyl-N,2,4,6-tetranitro-; CE; N-Methyl-N-picrylnitramine; N-Picryl-N-methylnitramine; Nitramine; Picrylmethylnitramine; Picrylnitromethylamine; Tetralit; Tetralite; Tetril; 2,4,6-(Trinitrophenyl)methylnitramine; 2,4,6-(Trinitrophenyl)methylnitroamine; 2,4,6-Tetryl; 2,4,6-Trinitrophenyl-N-methylnitramine; UN 0208; N-Methyl-N,2,4,6-tetranitrobenzenamine; N-Methyl-N,2,4,6-tetranitroaniline (tetryl); Nitramine (indicator); NSC 2166

Condensed phase thermochemistry data

Data compiled as indicated in comments:
ALS - Hussein Y. Afeefy, Joel F. Liebman, and Stephen E. Stein
DH - Eugene S. Domalski and Elizabeth D. Hearing
Quantity | Value | Units | Method | Reference | Comment |
---|---|---|---|---|---|
ΔfH°solid | 41. ± 4.6 | kJ/mol | Ccb | Krien, Licht, et al., 1973 | Author's hf298_condensed=7. kcal/mol; ALS |
ΔfH°solid | 30.7 | kJ/mol | Ccb | Rinkenbach, 1930 | Author hf298_condensed[kcal/mol]=4.69; ALS |
Quantity | Value | Units | Method | Reference | Comment |
ΔcH°solid | -3500. ± 30. | kJ/mol | AVG | N/A | Average of 6 values; Individual data points |
Constant pressure heat capacity of solid
Cp,solid (J/mol*K) | Temperature (K) | Reference | Comment |
---|---|---|---|
290.9 | 298. | Yin, Ziru, et al., 1991 | T = 290 to 345 K. Cp value reported at 298 K is 1.013 J/g*K.; DH |
302.1 | 298. | Krien, Licht, et al., 1973 | T = 200 to 403 K. Equation only.; DH |
260.7 | 293. | Taylor and Rinkenbach, 1924 | T = 90 to 370 K.; DH |

Phase change data

Data compiled as indicated in comments:
TRC - Thermodynamics Research Center, NIST Boulder Laboratories, Chris Muzny director
AC - William E. Acree, Jr., James S. Chickos
DH - Eugene S. Domalski and Elizabeth D. Hearing
Quantity | Value | Units | Method | Reference | Comment |
---|---|---|---|---|---|
Tfus | 402.6 | K | N/A | Krien, Licht, et al., 1973, 2 | Uncertainty assigned by TRC = 0.1 K; TRC |
Tfus | 400.5 | K | N/A | Hall, 1971 | Uncertainty assigned by TRC = 0.5 K; TRC |
Quantity | Value | Units | Method | Reference | Comment |
ΔsubH° | 133.8 ± 1.6 | kJ/mol | ME | Cundall, Frank Palmer, et al., 1978 | Based on data from 335. to 416. K.; AC |
Enthalpy of fusion
ΔfusH (kJ/mol) | Temperature (K) | Reference | Comment |
---|---|---|---|
25.86 | 402.6 | Domalski and Hearing, 1996 | AC |
22.930 | 402.6 | Krien, Licht, et al., 1973 | DH |
25.857 | 400.5 | Hall, 1971, 2 | DH |
Entropy of fusion
ΔfusS (J/mol*K) | Temperature (K) | Reference | Comment |
---|---|---|---|
57.0 | 402.6 | Krien, Licht, et al., 1973 | DH |

Kovats' RI, non-polar column, custom temperature program

Column type | Active phase | I | Reference | Comment |
---|---|---|---|---|
Capillary | Methyl Silicone | 2100. | Staples, 2005 | Column diameter: 0.25 mm; Program: not specified |

Normal alkane RI, non-polar column, custom temperature program

Column type | Active phase | I | Reference | Comment |
---|---|---|---|---|
Capillary | DB-5 | 2100. | Staples, 2004 | He; Program: not specified |
Capillary | DB-5 | 2113. | Staples, 2004 | He; Program: not specified |

References

Krien, Licht, et al., 1973
Krien, G.; Licht, H.H.; Zierath, J.,
Thermochemical investigation of nitramines,
Thermochim. Acta, 1973, 6, 465-472. [all data]
Rinkenbach, 1930
Rinkenbach, W.H.,
The heats of combustion and formation of aromatic nitro compounds,
J. Am. Chem. Soc., 1930, 52, 115-120. [all data]
Yin, Ziru, et al., 1991
Yin, C.; Ziru, L.; Ganghe, W.; Chengyun, W., et al.,
Determination of heat capacity of explosives and related materials by DSC,
Proc. Int. Pyrotech. Semin. 17th(Vol. 1), 1991, 515-521. [all data]
Taylor and Rinkenbach, 1924
Taylor, C.A.; Rinkenbach, W.H.,
The specific heats of trinitrotoluene, tetryl, picric acid and their molecular complexes,
J. Am. Chem. Soc., 1924, 46, 1504-1510. [all data]
Krien, Licht, et al., 1973, 2
Krien, G.; Licht, H.H.; Zierath, J.,
Thermochemistry study of an nitroamine,
Thermochim. Acta, 1973, 6, 465-72. [all data]
Hall, 1971
Hall, P.G.,
Thermal decomposition and phase transition in solid nitramines,
Trans. Faraday Soc., 1971, 67, 556-62. [all data]
Cundall, Frank Palmer, et al., 1978
Cundall, Robert B.; Frank Palmer, T.; Wood, Colin E.C.,
Vapour pressure measurements on some organic high explosives,
J. Chem. Soc., Faraday Trans. 1, 1978, 74, 0, 1339, https://doi.org/10.1039/f19787401339
. [all data]
Domalski and Hearing, 1996
Domalski, Eugene S.; Hearing, Elizabeth D.,
Heat Capacities and Entropies of Organic Compounds in the Condensed Phase. Volume III,
J. Phys. Chem. Ref. Data, 1996, 25, 1, 1, https://doi.org/10.1063/1.555985
. [all data]
Hall, 1971, 2
Hall, P.G.,
Thermal decomposition and phase transitions in solid nitramines,
Trans. Faraday Soc., 1971, 67(3), 556-562. [all data]
Staples, 2005
Staples, E.J.,
Ultrahigh-speed chromatography and virtual chemical sensors for detecting explosives and chemical warfare agents,
IEEE Sens. J., 2005, 5, 4, 622-631, https://doi.org/10.1109/JSEN.2005.850990
. [all data]
Staples, 2004
Staples, E.J.,
Analysis of odors from explosives using an electronic nose, 2004, retrieved from http://www.estcal.com/TechPapers/OdorsofExplosives.doc. [all data]