Diazene, bis(4-ethoxyphenyl)-, 1-oxide
- Formula: C16H18N2O3
- Molecular weight: 286.3257
- IUPAC Standard InChIKey: QUICZVHSJNKDBL-UHFFFAOYSA-N
- CAS Registry Number: 4792-83-0
- Chemical structure:

Gas phase thermochemistry data

Data compiled by: Hussein Y. Afeefy, Joel F. Liebman, and Stephen E. Stein
Quantity | Value | Units | Method | Reference | Comment |
---|---|---|---|---|---|
ΔfH°gas | -37.4 ± 3.7 | kJ/mol | Ccb | Acree, Tucker, et al., 1993 |

Condensed phase thermochemistry data

Data compiled as indicated in comments:
DH - Eugene S. Domalski and Elizabeth D. Hearing
ALS - Hussein Y. Afeefy, Joel F. Liebman, and Stephen E. Stein
Quantity | Value | Units | Method | Reference | Comment |
---|---|---|---|---|---|
ΔfH°solid | -163.6 ± 2.6 | kJ/mol | Ccb | Acree, Tucker, et al., 1993 | ALS |
ΔfH°solid | -45.6 | kJ/mol | Ccb | Lemoul, 1908 | ALS |
ΔfH°solid | -45.86 | kJ/mol | Ccb | Lemoult, 1906 | Author value for hf298-condensed=21.1 kcal/mol; ALS |
Quantity | Value | Units | Method | Reference | Comment |
ΔcH°solid | -8705.0 ± 1.5 | kJ/mol | Ccb | Acree, Tucker, et al., 1993 | ALS |
ΔcH°solid | -8822.8 | kJ/mol | Ccb | Lemoul, 1908 | ALS |
ΔcH°solid | -8822.8 | kJ/mol | Ccb | Lemoult, 1906 | Author value for hf298-condensed=21.1 kcal/mol; ALS |
Constant pressure heat capacity of liquid
Cp,liquid (J/mol*K) | Temperature (K) | Reference | Comment |
---|---|---|---|
607. | 430. | Kreutzer, 1938 | Value a few degrees below anisotropic-isotropic liquid-liquid transition at 436 K.; DH |

Phase change data

Data compiled as indicated in comments:
ALS - Hussein Y. Afeefy, Joel F. Liebman, and Stephen E. Stein
AC - William E. Acree, Jr., James S. Chickos
DH - Eugene S. Domalski and Elizabeth D. Hearing
Quantity | Value | Units | Method | Reference | Comment |
---|---|---|---|---|---|
ΔsubH° | 126.2 ± 2.7 | kJ/mol | C | Acree, Tucker, et al., 1993 | ALS |
ΔsubH° | 126.2 ± 2.7 | kJ/mol | C | Acree, 1993 | AC |
Enthalpy of fusion
ΔfusH (kJ/mol) | Temperature (K) | Reference | Comment |
---|---|---|---|
27.000 | 406.5 | Acree, Tucker, et al., 1993 | DH |
Enthalpy of phase transition
ΔHtrs (kJ/mol) | Temperature (K) | Initial Phase | Final Phase | Reference | Comment |
---|---|---|---|---|---|
1.700 | 438.5 | liquid | liquid | Acree, Tucker, et al., 1993 | Nematic/liq.; DH |

Gas phase ion energetics data

Data compiled as indicated in comments:
LLK - Sharon G. Lias, Rhoda D. Levin, and Sherif A. Kafafi
Ionization energy determinations
IE (eV) | Method | Reference | Comment |
---|---|---|---|
7.2 | PE | Millefiori, Ciliberto, et al., 1981 | LLK |
7.65 | PE | Millefiori, Ciliberto, et al., 1981 | Vertical value; LLK |

References

Acree, Tucker, et al., 1993
Acree, W.E., Jr.; Tucker, S.A.; Pilcher, G.; Paz Andrade, M.I.; Ribeiro da Silva, M.D.M.C.,
Enthalpies of combustion of p-azoxyanisole p-azoxyphenetole: the dissociation enthalpy of the N-O bonds. Enthalpies of crystal-to-(liquid crystal) transitions,
J. Chem. Thermodyn., 1993, 25, 653-659. [all data]
Lemoul, 1908
Lemoul, M.P.,
Recherches theoriques et experimentals sur les chaleurs de combustion et de formation des couposes organiques,
Anal. Chem., 1908, 184-190. [all data]
Lemoult, 1906
Lemoult, M.P.,
Thermochimie. - Chaleur de combustion et de formation de quelques composes cycliques azotes,
Compt. Rend., 1906, 143, 772-775. [all data]
Kreutzer, 1938
Kreutzer, C.,
Kalorimetrische Messungen beim Übergang von der anisotropen zur isotropen flüssigen Phase,
Ann. Physik. [5]33, 1938, 192-209. [all data]
Acree, 1993
Acree, W.,
Enthalpies of combustion of p-azoxyanisole and p-azoxyphenetole: the dissociation enthalpy of the N-O bonds. Enthalpies of crystal-to-(liquid crystal) transitions,
The Journal of Chemical Thermodynamics, 1993, 25, 5, 653-659, https://doi.org/10.1006/jcht.1993.1062
. [all data]
Millefiori, Ciliberto, et al., 1981
Millefiori, S.; Ciliberto, E.; Millefiori, A.; Zerbo, M.A.,
Gas phase U. V. photoelectron investigation of azoxybenzene and 4,4'-di(n-alkoxy)azoxybenzenes,
Spectromchim. Acta Part A, 1981, 37, 605. [all data]