1,8-Naphthalenediamine
- Formula: C10H10N2
- Molecular weight: 158.1998
- IUPAC Standard InChIKey: YFOOEYJGMMJJLS-UHFFFAOYSA-N
- CAS Registry Number: 479-27-6
- Chemical structure:
View 3d structure (requires JavaScript / HTML 5) - Other names: Naphthalene-1,8-diamine; 1,8-Diaminonaphthalene; 1,8-Naphthylenediamine

Phase change data

Data compiled as indicated in comments:
BS - Robert L. Brown and Stephen E. Stein
AC - William E. Acree, Jr., James S. Chickos
Quantity | Value | Units | Method | Reference | Comment |
---|---|---|---|---|---|
ΔvapH° | 79.6 ± 0.3 | kJ/mol | GS | Verevkin, Georgieva, et al., 2007 | Based on data from 339. to 379. K.; AC |
Quantity | Value | Units | Method | Reference | Comment |
ΔsubH° | 99.0 ± 0.7 | kJ/mol | ME | Ribeiro da Silva, Lobo Ferreira, et al., 2010 | Based on data from 314. to 338. K.; AC |
ΔsubH° | 94.1 ± 0.4 | kJ/mol | GS | Verevkin, Georgieva, et al., 2007 | Based on data from 304. to 335. K.; AC |
Reduced pressure boiling point
Tboil (K) | Pressure (bar) | Reference | Comment |
---|---|---|---|
478.2 | 0.016 | Aldrich Chemical Company Inc., 1990 | BS |
Enthalpy of sublimation
ΔsubH (kJ/mol) | Temperature (K) | Method | Reference | Comment |
---|---|---|---|---|
97.6 ± 0.7 | 326. | ME | Ribeiro da Silva, Lobo Ferreira, et al., 2010 | Based on data from 314. to 338. K.; AC |
Enthalpy of fusion
ΔfusH (kJ/mol) | Temperature (K) | Method | Reference | Comment |
---|---|---|---|---|
16.15 | 339.8 | DSC | Verevkin, Georgieva, et al., 2007 | AC |

Reaction thermochemistry data

Data compiled by: John E. Bartmess
Individual Reactions
C10H9N2- + =
By formula: C10H9N2- + H+ = C10H10N2
Quantity | Value | Units | Method | Reference | Comment |
---|---|---|---|---|---|
ΔrG° | 1441. ± 8.4 | kJ/mol | IMRE | Arnett, Venkatasubaramanian, et al., 1982 | gas phase; value altered from reference due to change in acidity scale |

Gas phase ion energetics data

Data evaluated as indicated in comments:
HL - Edward P. Hunter and Sharon G. Lias
Data compiled as indicated in comments:
B - John E. Bartmess
LLK - Sharon G. Lias, Rhoda D. Levin, and Sherif A. Kafafi
Quantity | Value | Units | Method | Reference | Comment |
---|---|---|---|---|---|
Proton affinity (review) | 944.5 | kJ/mol | N/A | Hunter and Lias, 1998 | HL |
Quantity | Value | Units | Method | Reference | Comment |
Gas basicity | 912.1 | kJ/mol | N/A | Hunter and Lias, 1998 | HL |
Appearance energy determinations
Ion | AE (eV) | Other Products | Method | Reference | Comment |
---|---|---|---|---|---|
C10H10N2+ | 6.65 ± 0.02 | ? | PE | Maier, 1974 | LLK |
De-protonation reactions
C10H9N2- + =
By formula: C10H9N2- + H+ = C10H10N2
Quantity | Value | Units | Method | Reference | Comment |
---|---|---|---|---|---|
ΔrG° | 1441. ± 8.4 | kJ/mol | IMRE | Arnett, Venkatasubaramanian, et al., 1982 | gas phase; value altered from reference due to change in acidity scale; B |

References

Verevkin, Georgieva, et al., 2007
Verevkin, Sergey P.; Georgieva, Miglena; Melkhanova, Svetlana V.,
Vapor Pressures and Phase Transitions of a Series of the Aminonaphthalenes,
J. Chem. Eng. Data, 2007, 52, 1, 286-290, https://doi.org/10.1021/je060394v
. [all data]
Ribeiro da Silva, Lobo Ferreira, et al., 2010
Ribeiro da Silva, Manuel A.V.; Lobo Ferreira, Ana I.M.C.; Santos, Ana Filipa L.O.M.; Ferreira, Cristiana M.A.; Barros, Delfina C.B.; Reis, Joana A.C.; Costa, José C.S.; Calvinho, Maria Miguel G.; Rocha, Sónia I.A.; Pinto, Sónia P.; Freire, Sónia S.L.; Almeida, Suzete M.; Guimarães, Vanessa S.; Almeida, Vasco N.M.,
Enthalpies of combustion, vapour pressures, and enthalpies of sublimation of the 1,5- and 1,8-diaminonaphthalenes,
The Journal of Chemical Thermodynamics, 2010, 42, 3, 371-379, https://doi.org/10.1016/j.jct.2009.09.009
. [all data]
Aldrich Chemical Company Inc., 1990
Aldrich Chemical Company Inc.,
Catalog Handbook of Fine Chemicals, Aldrich Chemical Company, Inc., Milwaukee WI, 1990, 1. [all data]
Arnett, Venkatasubaramanian, et al., 1982
Arnett, E.M.; Venkatasubaramanian, K.G.; McIver, R.T.; Fukuda, E.K.; Bordwell, F.G.; Press, F.D.,
Stabilization of the monoanion of 1,8-diaminonaphthalene by intramolecular hydrogen bonding. A novel case of anion homoconjugation in superbase solution,
J. Am. Chem. Soc., 1982, 104, 325. [all data]
Hunter and Lias, 1998
Hunter, E.P.; Lias, S.G.,
Evaluated Gas Phase Basicities and Proton Affinities of Molecules: An Update,
J. Phys. Chem. Ref. Data, 1998, 27, 3, 413-656, https://doi.org/10.1063/1.556018
. [all data]
Maier, 1974
Maier, J.P.,
Photoelectron spectroscopy of peri- amino naphthalenes,
Helv. Chim. Acta, 1974, 57, 994. [all data]