Butane, 1-(ethenylthio)-
- Formula: C6H12S
- Molecular weight: 116.224
- IUPAC Standard InChIKey: LBMGSGLAWRZARD-UHFFFAOYSA-N
- CAS Registry Number: 4789-70-2
- Chemical structure:
View 3d structure (requires JavaScript / HTML 5) - Other names: 3-Thia-1-heptene; Butyl vinyl sulfide

Gas phase ion energetics data

Data compiled by: Sharon G. Lias, Rhoda D. Levin, and Sherif A. Kafafi
Ionization energy determinations
IE (eV) | Method | Reference |
---|---|---|
8.15 ± 0.01 | PI | Trofimov, Mel'der, et al., 1975 |

Kovats' RI, non-polar column, isothermal

Column type | Active phase | Temperature (C) | I | Reference | Comment |
---|---|---|---|---|---|
Packed | Apiezon M | 130. | 893. | Garbuzov, Misharina, et al., 1985 | He or N2, Chromosorb W, AW-DMCS; Column length: 2.1 m |
Packed | Apiezon M | 130. | 893. | Golovnya, Misharina, et al., 1978 | Chromosorb W, AW-DMCS; Column length: 2.1 m |

Normal alkane RI, non-polar column, custom temperature program

Column type | Active phase | I | Reference | Comment |
---|---|---|---|---|
Capillary | Methyl Silicone | 847. | Savelieva and Zenkevich I., 2003 | Program: not specified |

References

Trofimov, Mel'der, et al., 1975
Trofimov, B.A.; Mel'der, U.K.; Pikver, R.I.; Vyalykh, E.P.,
Ionization potentials of unsaturated and sulfides the participation of neighboring multiple bonds of heteroatoms in the stabilization of the radical cation,
Teor. Eksp. Khim., 1975, 11, 129. [all data]
Garbuzov, Misharina, et al., 1985
Garbuzov, V.G.; Misharina, T.A.; Aerov, A.F.; Golovnya, R.V.,
Gas chromatographic retention indices for sulphur(II)-containing organic substances,
J. Anal. Chem. USSR (Engl. Transl.), 1985, 40, 4, 576-586. [all data]
Golovnya, Misharina, et al., 1978
Golovnya, R.V.; Misharina, T.A.; Garbuzov, V.G.,
Gas chromatographic characterization of sulfur-containing compounds. 4. The effect of unsaturated radicals on the retention indices of the vinyl, allyl, and propargyl alkyl sulfides,
Izv. Akad. Nauk SSSR Ser. Khim., 1978, 11, 2266-2270. [all data]
Savelieva and Zenkevich I., 2003
Savelieva, E.; Zenkevich I.,
Analisi GC/MS di agenti chimici nervini,
Laboratorio 2000, 2003, 17, 6/7, 24-26. [all data]