Furan, 2,5-bis(1,1-dimethylethyl)-
- Formula: C12H20O
- Molecular weight: 180.2866
- IUPAC Standard InChIKey: LHCFPVDATVVDLD-UHFFFAOYSA-N
- CAS Registry Number: 4789-40-6
- Chemical structure:
View 3d structure (requires JavaScript / HTML 5) - Permanent link for this species. Use this link for bookmarking this species for future reference.

Phase change data

Data compiled as indicated in comments:
BS - Robert L. Brown and Stephen E. Stein
AC - William E. Acree, Jr., James S. Chickos
Quantity | Value | Units | Method | Reference | Comment |
---|---|---|---|---|---|
Tboil | 483.2 | K | N/A | Weast and Grasselli, 1989 | BS |
Quantity | Value | Units | Method | Reference | Comment |
ΔvapH° | 56.1 ± 1.1 | kJ/mol | GS | Verevkin and Welle, 1998 | Based on data from 274. to 323. K.; AC |

Gas phase ion energetics data

Data evaluated as indicated in comments:
HL - Edward P. Hunter and Sharon G. Lias
Data compiled as indicated in comments:
LBLHLM - Sharon G. Lias, John E. Bartmess, Joel F. Liebman, John L. Holmes, Rhoda D. Levin, and W. Gary Mallard
Quantity | Value | Units | Method | Reference | Comment |
---|---|---|---|---|---|
Proton affinity (review) | 894.7 | kJ/mol | N/A | Hunter and Lias, 1998 | HL |
Quantity | Value | Units | Method | Reference | Comment |
Gas basicity | 863.9 | kJ/mol | N/A | Hunter and Lias, 1998 | HL |
Ionization energy determinations
IE (eV) | Method | Reference | Comment |
---|---|---|---|
7.66 | PE | Veszpremi, Nyulaszi, et al., 1987 | Vertical value; LBLHLM |

References

Weast and Grasselli, 1989
CRC Handbook of Data on Organic Compounds, 2nd Editon, Weast,R.C and Grasselli, J.G., ed(s)., CRC Press, Inc., Boca Raton, FL, 1989, 1. [all data]
Verevkin and Welle, 1998
Verevkin, Sergey P.; Welle, Frank M.,
Structural Chemistry, 1998, 9, 3, 215-221, https://doi.org/10.1023/A:1022475115296
. [all data]
Hunter and Lias, 1998
Hunter, E.P.; Lias, S.G.,
Evaluated Gas Phase Basicities and Proton Affinities of Molecules: An Update,
J. Phys. Chem. Ref. Data, 1998, 27, 3, 413-656, https://doi.org/10.1063/1.556018
. [all data]
Veszpremi, Nyulaszi, et al., 1987
Veszpremi, T.; Nyulaszi, L.; Nagy, J.,
Ultraviolet photoelectron spectroscopy and quantum-mechanical study of alkyl- and trimethylsilyl-furanes,
J. Organomet. Chem., 1987, 331, 175. [all data]