9,10[1',2']-Benzenoanthracene, 9,10-dihydro-
- Formula: C20H14
- Molecular weight: 254.3252
- IUPAC Standard InChIKey: NGDCLPXRKSWRPY-UHFFFAOYSA-N
- CAS Registry Number: 477-75-8
- Chemical structure:
View 3d structure (requires JavaScript / HTML 5) - Other names: Triptycene; 9,10-o-Benzenoanthracene, 9,10-dihydro-; Tribenzobicyclo[2.2.2]octatriene; Tryptycene; Anthracene, 9,10-dihydro-9,10-O-benzeno-; 9,10-o-benzeno-9,10-dihydroanthracene

Gas phase thermochemistry data

Data compiled as indicated in comments:
ALS - Hussein Y. Afeefy, Joel F. Liebman, and Stephen E. Stein
GT - Glushko Thermocenter, Russian Academy of Sciences, Moscow
Quantity | Value | Units | Method | Reference | Comment |
---|---|---|---|---|---|
ΔfH°gas | 322. ± 13. | kJ/mol | Ccb | Rodgers, Westrum, et al., 1973 | ALS |
Constant pressure heat capacity of gas
Cp,gas (J/mol*K) | Temperature (K) | Reference | Comment |
---|---|---|---|
283.47 | 298.15 | Bencivenni L., 1979 | GT |
355.64 | 370. | ||
365.01 | 380. | ||
374.18 | 390. | ||
383.17 | 400. | ||
391.96 | 410. | ||
400.53 | 420. | ||
409.24 | 430. |

Condensed phase thermochemistry data

Data compiled as indicated in comments:
ALS - Hussein Y. Afeefy, Joel F. Liebman, and Stephen E. Stein
DH - Eugene S. Domalski and Elizabeth D. Hearing
Quantity | Value | Units | Method | Reference | Comment |
---|---|---|---|---|---|
ΔfH°solid | 217.1 ± 1.3 | kJ/mol | Ccb | Rodgers, Westrum, et al., 1973 | ALS |
Quantity | Value | Units | Method | Reference | Comment |
ΔcH°solid | -10088.2 ± 1.2 | kJ/mol | Ccb | Rodgers, Westrum, et al., 1973 | Corresponding ΔfHºsolid = 217.1 kJ/mol (simple calculation by NIST; no Washburn corrections); ALS |
Quantity | Value | Units | Method | Reference | Comment |
S°solid,1 bar | 273.97 | J/mol*K | N/A | Andrews and Westrum, 1970 | DH |
Constant pressure heat capacity of solid
Cp,solid (J/mol*K) | Temperature (K) | Reference | Comment |
---|---|---|---|
283.1 | 298.15 | Rodgers, Westrum, et al., 1973 | Cp given as 0.266 cal/g*K.; DH |
282.67 | 298.15 | Andrews and Westrum, 1970 | T = 5 to 550 K.; DH |

Phase change data

Data compiled as indicated in comments:
TRC - Thermodynamics Research Center, NIST Boulder Laboratories, Chris Muzny director
ALS - Hussein Y. Afeefy, Joel F. Liebman, and Stephen E. Stein
DRB - Donald R. Burgess, Jr.
DH - Eugene S. Domalski and Elizabeth D. Hearing
AC - William E. Acree, Jr., James S. Chickos
Quantity | Value | Units | Method | Reference | Comment |
---|---|---|---|---|---|
Ttriple | 527.18 | K | N/A | Andrews and Westrum, 1970, 2 | Uncertainty assigned by TRC = 0.02 K; TRC |
Quantity | Value | Units | Method | Reference | Comment |
ΔsubH° | 105. ± 13. | kJ/mol | V | Rodgers, Westrum, et al., 1973 | ALS |
ΔsubH° | 104.9 | kJ/mol | N/A | Rodgers, Westrum, et al., 1973 | DRB |
Enthalpy of fusion
ΔfusH (kJ/mol) | Temperature (K) | Reference | Comment |
---|---|---|---|
30.275 | 527.18 | Andrews and Westrum, 1970 | DH |
30.29 | 527.2 | Domalski and Hearing, 1996 | AC |
Entropy of fusion
ΔfusS (J/mol*K) | Temperature (K) | Reference | Comment |
---|---|---|---|
57.43 | 527.18 | Andrews and Westrum, 1970 | DH |

Gas phase ion energetics data

Data compiled as indicated in comments:
LBLHLM - Sharon G. Lias, John E. Bartmess, Joel F. Liebman, John L. Holmes, Rhoda D. Levin, and W. Gary Mallard
Ionization energy determinations
IE (eV) | Method | Reference | Comment |
---|---|---|---|
7.8 | PE | Martin, Mayer, et al., 1983 | LBLHLM |
7.8 | PE | Haselbach, Neuhaus, et al., 1982 | LBLHLM |
7.89 | PE | Martin, Mayer, et al., 1983 | Vertical value; LBLHLM |
7.9 | PE | Haselbach, Neuhaus, et al., 1982 | Vertical value; LBLHLM |

Van Den Dool and Kratz RI, non-polar column, temperature ramp

Column type | Active phase | I | Reference | Comment |
---|---|---|---|---|
Capillary | DB-5 | 2228. | Rostad and Pereira, 1986 | 30. m/0.26 mm/0.25 μm, He, 50. C @ 4. min, 6. K/min, 300. C @ 20. min |
Capillary | SE-52 | 2179. | Beernaert, 1979 | He, 50. C @ 5. min, 6. K/min; Column length: 33.3 m; Column diameter: 0.50 mm; Tend: 320. C |

Lee's RI, non-polar column, temperature ramp

Column type | Active phase | I | Reference | Comment |
---|---|---|---|---|
Capillary | DB-5 | 365.02 | Rostad and Pereira, 1986 | 30. m/0.26 mm/0.25 μm, He, 50. C @ 4. min, 6. K/min, 300. C @ 20. min |

Lee's RI, non-polar column, custom temperature program

Column type | Active phase | I | Reference | Comment |
---|---|---|---|---|
Capillary | SE-52 | 366.41 | Shlyakhov, 1984 | Program: not specified |

References

Rodgers, Westrum, et al., 1973
Rodgers, D.L.; Westrum, E.F., Jr.; Andrews, J.T.S.,
The enthalpies of combustion and formation of [2.2]-paracyclophane and triptycene,
J. Chem. Thermodyn., 1973, 5, 733-739. [all data]
Bencivenni L., 1979
Bencivenni L.,
Vibrational spectrum and thermodynamic functions of gaseous triptycene,
J. Mol. Struct., 1979, 53, 25-29. [all data]
Andrews and Westrum, 1970
Andrews, J.T.S.; Westrum, E.F., Jr.,
The heat capacity and thermodynamic functions of crystalline and liquid triptycene,
J. Chem. Thermodynam., 1970, 2, 245-253. [all data]
Andrews and Westrum, 1970, 2
Andrews, J.T.S.; Westrum, E.F.,
The heat capacity and thermodynamic functions of crystalline and liquid triptycene,
J. Chem. Thermodyn., 1970, 2, 245. [all data]
Domalski and Hearing, 1996
Domalski, Eugene S.; Hearing, Elizabeth D.,
Heat Capacities and Entropies of Organic Compounds in the Condensed Phase. Volume III,
J. Phys. Chem. Ref. Data, 1996, 25, 1, 1, https://doi.org/10.1063/1.555985
. [all data]
Martin, Mayer, et al., 1983
Martin, H.-D.; Mayer, B.; Gleiter, R.; Schafer, W.; Vogtle, F.,
Photoelektronenspektroskopische untersuchung transanularer π-,σ- und n-wechselwirkungen in bruckenkopfsubstituierten triptycenen,
Chem. Ber., 1983, 116, 2546. [all data]
Haselbach, Neuhaus, et al., 1982
Haselbach, E.; Neuhaus, L.; Johnson, R.P.; Houk, K.N.; Paddon-Row, M.N.,
.PI.-Orbital interactions in mobius-type molecules as studied by photoelectron spectroscopy,
Helv. Chim. Acta, 1982, 65, 1743. [all data]
Theilacker and Hannover, 1966
Theilacker, W.; Hannover, T.H.,
UV atlas of organic compounds, 1966, 1, D3/2. [all data]
Rostad and Pereira, 1986
Rostad, C.E.; Pereira, W.E.,
Kovats and Lee retention indices determined by gas chromatography/mass spectrometry for organic compounds of environmental interest,
J. Hi. Res. Chromatogr. Chromatogr. Comm., 1986, 9, 6, 328-334, https://doi.org/10.1002/jhrc.1240090603
. [all data]
Beernaert, 1979
Beernaert, H.,
Gas Chromatographic Analysis of Polyclylic Aromatic Hydrocarbons,
J. Chromatogr., 1979, 173, 1, 109-118, https://doi.org/10.1016/S0021-9673(01)80450-7
. [all data]
Shlyakhov, 1984
Shlyakhov, A.F.,
Gas chromatography in organic geochemistry, Nedra, Moscow, 1984, 221. [all data]