1,4-Naphthalenedione, 5,8-dihydroxy-
- Formula: C10H6O4
- Molecular weight: 190.1522
- IUPAC Standard InChIKey: RQNVIKXOOKXAJQ-UHFFFAOYSA-N
- CAS Registry Number: 475-38-7
- Chemical structure:
View 3d structure (requires JavaScript / HTML 5) - Other names: 1,4-Naphthoquinone, 5,8-dihydroxy-; Naphthazarin; Naphthazarine; Naphthazarone; 5,8-Dihydroxy-1,4-naphthoquinone; 5,8-Dihydroxynaphthoquinone; 5,8-Dihydroxy-1,4-naphthalenedione; 5,8-Dihydroxy-1,4-naphthosemiquinone; NSC 26647

Gas phase thermochemistry data

Data compiled by: Hussein Y. Afeefy, Joel F. Liebman, and Stephen E. Stein
Quantity | Value | Units | Method | Reference | Comment |
---|---|---|---|---|---|
ΔfH°gas | -499.1 ± 3.2 | kJ/mol | Ccb | Ribeiro Da Silva, Ribeiro Da Silva, et al., 1989 |

Condensed phase thermochemistry data

Data compiled by: Hussein Y. Afeefy, Joel F. Liebman, and Stephen E. Stein
Quantity | Value | Units | Method | Reference | Comment |
---|---|---|---|---|---|
ΔfH°solid | -595.8 ± 2.1 | kJ/mol | Ccb | Ribeiro Da Silva, Ribeiro Da Silva, et al., 1989 | |
Quantity | Value | Units | Method | Reference | Comment |
ΔcH°solid | -4196.8 ± 0.5 | kJ/mol | Ccb | Ribeiro Da Silva, Ribeiro Da Silva, et al., 1989 | Corresponding ΔfHºsolid = -595.8 kJ/mol (simple calculation by NIST; no Washburn corrections) |

Phase change data

Data compiled by: Donald R. Burgess, Jr.
Quantity | Value | Units | Method | Reference | Comment |
---|---|---|---|---|---|
ΔsubH° | 96.7 | kJ/mol | N/A | Ribeiro Da Silva, Ribeiro Da Silva, et al., 1989 |

Gas phase ion energetics data

Data compiled by: Sharon G. Lias, Rhoda D. Levin, and Sherif A. Kafafi
Ionization energy determinations
IE (eV) | Method | Reference |
---|---|---|
8.20 ± 0.02 | PI | Potapov and Sorokin, 1971 |

References

Ribeiro Da Silva, Ribeiro Da Silva, et al., 1989
Ribeiro Da Silva, M.A.V.; Ribeiro Da Silva, D.M.C.; Teixeira, J.A.S.,
Enthalpies of combustion of 1,4-naphthoquinone, 9,10-anthraquinone, 9,10-phenanthraquinone, 1,4,9,10-anthradiquinone, 5,8-dihydroxy-1,4-naphthoquinone, and 1,4-dihydroxy-9,10-anthraquinone,
J. Chem. Thermodyn., 1989, 21, 265-274. [all data]
Potapov and Sorokin, 1971
Potapov, V.K.; Sorokin, V.V.,
Photoionization and ion-molecule reactions in quinones and alcohols,
High Energy Chem., 1971, 5, 435, In original 487. [all data]