11-Azabicyclo[4.4.1]undeca-1,3,5,7,9-pentaene
- Formula: C10H9N
- Molecular weight: 143.1852
- IUPAC Standard InChIKey: DJDJGVOVSUVRDI-UHFFFAOYSA-N
- CAS Registry Number: 4753-55-3
- Chemical structure:
View 3d structure (requires JavaScript / HTML 5) - Other names: 1,6-Imino-(10)annulene

Gas phase thermochemistry data

Data compiled by: Hussein Y. Afeefy, Joel F. Liebman, and Stephen E. Stein
Quantity | Value | Units | Method | Reference | Comment |
---|---|---|---|---|---|
ΔfH°gas | 367. ± 3. | kJ/mol | Ccb | Bremser, Hagen, et al., 1969 |

Condensed phase thermochemistry data

Data compiled by: Hussein Y. Afeefy, Joel F. Liebman, and Stephen E. Stein
Quantity | Value | Units | Method | Reference | Comment |
---|---|---|---|---|---|
ΔfH°liquid | 308. ± 3. | kJ/mol | Ccb | Bremser, Hagen, et al., 1969 | |
Quantity | Value | Units | Method | Reference | Comment |
ΔcH°liquid | -5529.24 | kJ/mol | Ccb | Bremser, Hagen, et al., 1969 |

Phase change data

Data compiled as indicated in comments:
BS - Robert L. Brown and Stephen E. Stein
ALS - Hussein Y. Afeefy, Joel F. Liebman, and Stephen E. Stein
DRB - Donald R. Burgess, Jr.
Quantity | Value | Units | Method | Reference | Comment |
---|---|---|---|---|---|
Tfus | 289. | K | N/A | Buckingham and Donaghy, 1982 | BS |
Quantity | Value | Units | Method | Reference | Comment |
ΔvapH° | 59.29 | kJ/mol | V | Bremser, Hagen, et al., 1969 | ALS |
ΔvapH° | 59.0 | kJ/mol | N/A | Bremser, Hagen, et al., 1969 | DRB |
Reduced pressure boiling point
Tboil (K) | Pressure (bar) | Reference | Comment |
---|---|---|---|
333. to 334. | 0.00003 | Buckingham and Donaghy, 1982 | BS |

Gas phase ion energetics data

Data compiled as indicated in comments:
LBLHLM - Sharon G. Lias, John E. Bartmess, Joel F. Liebman, John L. Holmes, Rhoda D. Levin, and W. Gary Mallard
Ionization energy determinations
IE (eV) | Method | Reference | Comment |
---|---|---|---|
7.75 | PE | Andrea, Cerfontain, et al., 1984 | LBLHLM |
8.01 | PE | Andrea, Cerfontain, et al., 1984 | Vertical value; LBLHLM |

References

Bremser, Hagen, et al., 1969
Bremser, W.; Hagen, R.; Heilbronner, E.; Vogel, E.,
48. Die Bildungsenthalpie 1,6-uberbruckter [10]Annulene,
Helv. Chim. Acta, 1969, 52, 418-431. [all data]
Buckingham and Donaghy, 1982
Buckingham, J.; Donaghy, S.M.,
Dictionary of Organic Compounds: Fifth Edition, Chapman and Hall, New York, 1982, 1. [all data]
Andrea, Cerfontain, et al., 1984
Andrea, R.R.; Cerfontain, H.; Lamberchts, H.J.A.; Louwen, J.N.; Oskam, A.,
He I and He II photoelectron spectra and CNDO/S and MNDO MO calculations of some bridged [10] annulenes,
J. Am. Chem. Soc., 1984, 106, 2531. [all data]