Propene, 2-nitro-
- Formula: C3H5NO2
- Molecular weight: 87.0773
- IUPAC Standard InChIKey: GXEXLSDIVMVEFZ-UHFFFAOYSA-N
- CAS Registry Number: 4749-28-4
- Chemical structure:
View 3d structure (requires JavaScript / HTML 5) - Permanent link for this species. Use this link for bookmarking this species for future reference.

Phase change data

Data compiled as indicated in comments:
BS - Robert L. Brown and Stephen E. Stein
AC - William E. Acree, Jr., James S. Chickos
Reduced pressure boiling point
Tboil (K) | Pressure (bar) | Reference | Comment |
---|---|---|---|
330.2 | 0.133 | Weast and Grasselli, 1989 | BS |
Enthalpy of vaporization
ΔvapH (kJ/mol) | Temperature (K) | Method | Reference | Comment |
---|---|---|---|---|
38.2 | 288. | A | Stephenson and Malanowski, 1987 | Based on data from 273. to 333. K. See also Dykyj, 1970.; AC |

Gas phase ion energetics data

Data compiled by: Sharon G. Lias and Joel F. Liebman
Ionization energy determinations
IE (eV) | Method | Reference | Comment |
---|---|---|---|
10.4 | PE | Chin, Mok, et al., 1991 | |
10.71 | PE | Chin, Mok, et al., 1991 | Vertical value |

References

Weast and Grasselli, 1989
CRC Handbook of Data on Organic Compounds, 2nd Editon, Weast,R.C and Grasselli, J.G., ed(s)., CRC Press, Inc., Boca Raton, FL, 1989, 1. [all data]
Stephenson and Malanowski, 1987
Stephenson, Richard M.; Malanowski, Stanislaw,
Handbook of the Thermodynamics of Organic Compounds, 1987, https://doi.org/10.1007/978-94-009-3173-2
. [all data]
Dykyj, 1970
Dykyj, J.,
Petrochemica, 1970, 10, 2, 51. [all data]
Chin, Mok, et al., 1991
Chin, W.S.; Mok, C.Y.; Huang, H.H.,
He I and He II photoelectron spectra of isomeric nitropropenes,
J. Chem. Soc. Faraday Trans., 1991, 87, 1685. [all data]