2-Propanamine, N-methyl-
- Formula: C4H11N
- Molecular weight: 73.1368
- IUPAC Standard InChIKey: XHFGWHUWQXTGAT-UHFFFAOYSA-N
- CAS Registry Number: 4747-21-1
- Chemical structure:
View 3d structure (requires JavaScript / HTML 5) - Species with the same structure:
- Other names: Ethylamine, N,1-dimethyl-; Isopropylmethylamine; Methylisopropylamine; N-Methylisopropylamine; 2-Methylaminopropane; N-Isopropylmethylamine

Phase change data

Data compiled as indicated in comments:
BS - Robert L. Brown and Stephen E. Stein
AC - William E. Acree, Jr., James S. Chickos
Quantity | Value | Units | Method | Reference | Comment |
---|---|---|---|---|---|
Tboil | 324.7 | K | N/A | Aldrich Chemical Company Inc., 1990 | BS |
Tboil | 323.5 | K | N/A | Majer and Svoboda, 1985 | |
Quantity | Value | Units | Method | Reference | Comment |
Tc | 490.7 | K | N/A | Majer and Svoboda, 1985 | |
Quantity | Value | Units | Method | Reference | Comment |
ΔvapH° | 30.93 | kJ/mol | N/A | Majer and Svoboda, 1985 | |
ΔvapH° | 30.7 ± 0.1 | kJ/mol | C | Petros, Majer, et al., 1979 | AC |
Enthalpy of vaporization
ΔvapH (kJ/mol) | Temperature (K) | Method | Reference | Comment |
---|---|---|---|---|
28.71 | 323.5 | N/A | Majer and Svoboda, 1985 | |
29.5 ± 0.1 | 313. | C | Petros, Majer, et al., 1979 | AC |
27.1 ± 0.1 | 343. | C | Petros, Majer, et al., 1979 | AC |
30.9 | 306. | EB | Petros, Majer, et al., 1979 | Based on data from 293. to 319. K.; AC |
Enthalpy of vaporization
ΔvapH =
A exp(-βTr) (1 − Tr)β
ΔvapH =
Enthalpy of vaporization (at saturation pressure)
(kJ/mol)
Tr = reduced temperature (T / Tc)
View plot Requires a JavaScript / HTML 5 canvas capable browser.
Temperature (K) | A (kJ/mol) | β | Tc (K) | Reference | Comment |
---|---|---|---|---|---|
298. to 343. | 52.39 | 0.3465 | 490.7 | Majer and Svoboda, 1985 |

Gas phase ion energetics data

Data evaluated as indicated in comments:
HL - Edward P. Hunter and Sharon G. Lias
Data compiled as indicated in comments:
LLK - Sharon G. Lias, Rhoda D. Levin, and Sherif A. Kafafi
Quantity | Value | Units | Method | Reference | Comment |
---|---|---|---|---|---|
Proton affinity (review) | 952.4 | kJ/mol | N/A | Hunter and Lias, 1998 | HL |
Quantity | Value | Units | Method | Reference | Comment |
Gas basicity | 919.4 | kJ/mol | N/A | Hunter and Lias, 1998 | HL |
Appearance energy determinations
Ion | AE (eV) | Other Products | Method | Reference | Comment |
---|---|---|---|---|---|
C3H8N+ | 8.71 | CH3 | EI | Lossing, Lam, et al., 1981 | LLK |

Kovats' RI, non-polar column, isothermal

Column type | Active phase | Temperature (C) | I | Reference | Comment |
---|---|---|---|---|---|
Packed | Apiezon L | 100. | 542. | Golovnya, Zhuravleva, et al., 1981 | N2, Chromosorb GAW; Column length: 2.7 m |

References

Aldrich Chemical Company Inc., 1990
Aldrich Chemical Company Inc.,
Catalog Handbook of Fine Chemicals, Aldrich Chemical Company, Inc., Milwaukee WI, 1990, 1. [all data]
Majer and Svoboda, 1985
Majer, V.; Svoboda, V.,
Enthalpies of Vaporization of Organic Compounds: A Critical Review and Data Compilation, Blackwell Scientific Publications, Oxford, 1985, 300. [all data]
Petros, Majer, et al., 1979
Petros, Libor; Majer, Vladimír; Koubek, Josef; Svoboda, Václav; Pick, Jirí,
Temperature dependence of heats of vaporization, saturated vapour pressures and cohesive energies of secondary amines,
Collect. Czech. Chem. Commun., 1979, 44, 12, 3533-3540, https://doi.org/10.1135/cccc19793533
. [all data]
Hunter and Lias, 1998
Hunter, E.P.; Lias, S.G.,
Evaluated Gas Phase Basicities and Proton Affinities of Molecules: An Update,
J. Phys. Chem. Ref. Data, 1998, 27, 3, 413-656, https://doi.org/10.1063/1.556018
. [all data]
Lossing, Lam, et al., 1981
Lossing, F.P.; Lam, Y.-T.; Maccoll, A.,
Gas phase heats of formation of alkyl immonium ions,
Can. J. Chem., 1981, 59, 2228. [all data]
Golovnya, Zhuravleva, et al., 1981
Golovnya, R.V.; Zhuravleva, I.L.; Svetlova, N.I.; Grigor'eva, D.N.; Terenina, M.B.; Gutnik, S.B.,
Gas-chromatographic behavior of secondary isoaliphatic and alicyclic amines,
J. Anal. Chem. USSR (Engl. Transl.), 1981, 36, 4, 501-505. [all data]