Hexane, 1-methoxy-
- Formula: C7H16O
- Molecular weight: 116.2013
- IUPAC Standard InChIKey: ICBJCVRQDSQPGI-UHFFFAOYSA-N
- CAS Registry Number: 4747-07-3
- Chemical structure:
View 3d structure (requires JavaScript / HTML 5) - Other names: Ether, hexyl methyl; Hexyl methyl ether; Methyl hexyl ether; 1-Methoxyhexane

Phase change data

Quantity | Value | Units | Method | Reference | Comment |
---|---|---|---|---|---|
Tboil | 399.2 | K | N/A | Majer and Svoboda, 1985 | |
Quantity | Value | Units | Method | Reference | Comment |
ΔvapH° | 42.1 | kJ/mol | N/A | Majer and Svoboda, 1985 |
Enthalpy of vaporization
ΔvapH (kJ/mol) | Temperature (K) | Reference |
---|---|---|
34.93 | 399.2 | Majer and Svoboda, 1985 |

Gas phase ion energetics data

Data compiled by: Sharon G. Lias and Joel F. Liebman
Ionization energy determinations
IE (eV) | Method | Reference |
---|---|---|
≤9.48 | PI | Ahmmed, Hudson, et al., 1990 |
Appearance energy determinations
Ion | AE (eV) | Other Products | Method | Reference | Comment |
---|---|---|---|---|---|
CH5O+ | 9.63 | C5H8CH3 | PI | Ahmmed, Hudson, et al., 1990 | |
C6H12+ | 9.61 | CH3OH | PI | Ahmmed, Hudson, et al., 1990 |

Van Den Dool and Kratz RI, non-polar column, temperature ramp

Column type | Active phase | I | Reference | Comment |
---|---|---|---|---|
Capillary | CP Sil 5 CB | 808. | Pino, Marbot, et al., 2002 | 50. m/0.32 mm/0.4 μm, He, 60. C @ 10. min, 3. K/min, 280. C @ 60. min |

Van Den Dool and Kratz RI, non-polar column, custom temperature program

Column type | Active phase | I | Reference | Comment |
---|---|---|---|---|
Capillary | VF-5MS | 822.8 | Tret'yakov, 2007 | 30. m/0.25 mm/0.25 μm, He; Program: Multi-step temperature program; T(initial)=60C; T(final)=270C |
Capillary | VF-5MS | 823. | Tret'yakov, 2007 | 30. m/0.25 mm/0.25 μm, He; Program: Multi-step temperature program; T(initial)=60C; T(final)=270C |

Van Den Dool and Kratz RI, polar column, temperature ramp

Column type | Active phase | I | Reference | Comment |
---|---|---|---|---|
Capillary | AT-Wax | 924. | Pino, Marbot, et al., 2002 | 60. m/0.32 mm/0.25 μm, He, 65. C @ 10. min, 2. K/min, 250. C @ 60. min |

Normal alkane RI, non-polar column, temperature ramp

Column type | Active phase | I | Reference | Comment |
---|---|---|---|---|
Capillary | HP-5 | 832. | Mildner-Szkudlarz and Jelen, 2008 | 10. m/0.10 mm/0.40 μm, Helium, 40. C @ 1. min, 20. K/min, 280. C @ 1. min |
Capillary | MDN-5 | 832. | Mildner-Szkudlarz, Jelen, et al., 2003 | 30. m/0.25 mm/0.25 μm, He, 40. C @ 1. min, 20. K/min, 280. C @ 1. min |
Capillary | SPB-1 | 816. | Vichi, Castellote, et al., 2003 | 30. m/0.25 mm/0.25 μm, He, 40. C @ 10. min, 3. K/min; Tend: 200. C |
Capillary | SPB-1 | 818. | Vichi, Pizzale, et al., 2003 | 30. m/0.25 mm/0.25 μm, He, 40. C @ 10. min, 3. K/min; Tend: 200. C |

Normal alkane RI, non-polar column, custom temperature program

Column type | Active phase | I | Reference | Comment |
---|---|---|---|---|
Capillary | SE-30 | 824. | Vinogradov, 2004 | Program: not specified |

Normal alkane RI, polar column, temperature ramp

Column type | Active phase | I | Reference | Comment |
---|---|---|---|---|
Capillary | Supelcowax-10 | 941. | Vichi, Castellote, et al., 2003 | 30. m/0.25 mm/0.25 μm, He, 40. C @ 10. min, 3. K/min; Tend: 200. C |
Capillary | Supelcowax-10 | 940. | Vichi, Pizzale, et al., 2003 | 30. m/0.25 mm/0.25 μm, He, 40. C @ 10. min, 3. K/min; Tend: 200. C |

Normal alkane RI, polar column, custom temperature program

Column type | Active phase | I | Reference | Comment |
---|---|---|---|---|
Capillary | Carbowax 20M | 960. | Vinogradov, 2004 | Program: not specified |

References

Majer and Svoboda, 1985
Majer, V.; Svoboda, V.,
Enthalpies of Vaporization of Organic Compounds: A Critical Review and Data Compilation, Blackwell Scientific Publications, Oxford, 1985, 300. [all data]
Ahmmed, Hudson, et al., 1990
Ahmmed, M.S.; Hudson, C.E.; Traeger, J.C.; Giam, C.S.; McAdoo, D.J.,
ROH2+ formation from ionized n-hexyl ethers: An unequivocal dissocation through an ion-neutral complex in the gas phase,
J. Am. Chem. Soc., 1990, 112, 6443. [all data]
Pino, Marbot, et al., 2002
Pino, J.A.; Marbot, R.; Vázquez, C.,
Characterization of volatile in Cosa Rican Guava [Psidium friedrichsthalianum (Berg) Niedenzu] fruit,
J. Agric. Food Chem., 2002, 50, 21, 6023-6026, https://doi.org/10.1021/jf011456i
. [all data]
Tret'yakov, 2007
Tret'yakov, K.V.,
Retention Data. NIST Mass Spectrometry Data Center., NIST Mass Spectrometry Data Center, 2007. [all data]
Mildner-Szkudlarz and Jelen, 2008
Mildner-Szkudlarz, S.; Jelen, H.H.,
The potential of different techniques for volatile compounds analysis coupled with PCA for the detection of the adulteration of olive oil with hazelnut oil,
Food Chem., 2008, 110, 3, 751-761, https://doi.org/10.1016/j.foodchem.2008.02.053
. [all data]
Mildner-Szkudlarz, Jelen, et al., 2003
Mildner-Szkudlarz, S.; Jelen, H.H.; Zawirska-Wojtasiak, R.; Wasowicz, E.,
Application of headspace - solid phase microextraction and multivariate analysis for plant oils differentiation,
Food Chem., 2003, 83, 4, 515-522, https://doi.org/10.1016/S0308-8146(03)00147-X
. [all data]
Vichi, Castellote, et al., 2003
Vichi, S.; Castellote, A.I.; Pizzale, L.; Conte, L.S.; Buxaderas, S.; López-Tamames, E.,
Analysis of virgin olive oil volatile compounds by headspace solid-phase microextraction coupled to gas chromatography with mass spectrometric and flame ionization detection,
J. Chromatogr. A, 2003, 983, 1-2, 19-33, https://doi.org/10.1016/S0021-9673(02)01691-6
. [all data]
Vichi, Pizzale, et al., 2003
Vichi, S.; Pizzale, L.; Conte, L.S.; Buxaderas, S.; López-Tamames, E.,
Solid-phase microextraction in the analysis of virgin olive oil volatile fraction: characterization of virgin olive oils from two distinct geographical areas of Northern Italy,
J. Agric. Food Chem., 2003, 51, 22, 6572-6577, https://doi.org/10.1021/jf030269c
. [all data]
Vinogradov, 2004
Vinogradov, B.A.,
Production, composition, properties and application of essential oils, 2004, retrieved from http://viness.narod.ru. [all data]