2,3-Benzofurandione
- Formula: C8H4O3
- Molecular weight: 148.1156
- IUPAC Standard InChIKey: UUISWLJHAJBRAA-UHFFFAOYSA-N
- CAS Registry Number: 4732-72-3
- Chemical structure:
View 3d structure (requires JavaScript / HTML 5) - Other names: Coumarandione

Phase change data

Data compiled by: Robert L. Brown and Stephen E. Stein
Quantity | Value | Units | Method | Reference | Comment |
---|---|---|---|---|---|
Tfus | 407. | K | N/A | Buckingham and Donaghy, 1982 |
Reduced pressure boiling point
Tboil (K) | Pressure (bar) | Reference |
---|---|---|
415.2 | 0.023 | Weast and Grasselli, 1989 |
415. | 0.023 | Buckingham and Donaghy, 1982 |

Gas phase ion energetics data

Data compiled by: Sharon G. Lias, Rhoda D. Levin, and Sherif A. Kafafi
Ionization energy determinations
IE (eV) | Method | Reference | Comment |
---|---|---|---|
9.65 ± 0.05 | PE | Galasso, Colonna, et al., 1977 | Vertical value |

References

Buckingham and Donaghy, 1982
Buckingham, J.; Donaghy, S.M.,
Dictionary of Organic Compounds: Fifth Edition, Chapman and Hall, New York, 1982, 1. [all data]
Weast and Grasselli, 1989
CRC Handbook of Data on Organic Compounds, 2nd Editon, Weast,R.C and Grasselli, J.G., ed(s)., CRC Press, Inc., Boca Raton, FL, 1989, 1. [all data]
Galasso, Colonna, et al., 1977
Galasso, V.; Colonna, F.P.; Distefano, G.,
Photoelectron spectra of 1,2-indandione, 1,3-indandione and heterocyclic analogues,
J. Electron Spectrosc. Relat. Phenom., 1977, 10, 227. [all data]