Guanidine, methyl-
- Formula: C2H7N3
- Molecular weight: 73.0971
- IUPAC Standard InChIKey: CHJJGSNFBQVOTG-UHFFFAOYSA-N
- CAS Registry Number: 471-29-4
- Chemical structure:
View 3d structure (requires JavaScript / HTML 5) - Other names: Methylguanidine; N-Methylguanidine; N1-Methylguanidine; Methylguanidin; Monomethyl guanidin; Monomethylguanidine

Gas phase ion energetics data

Data compiled by: Henry M. Rosenstock, Keith Draxl, Bruce W. Steiner, and John T. Herron
Ionization energy determinations
IE (eV) | Method | Reference |
---|---|---|
8.60 ± 0.05 | EI | Loudon, Maccoll, et al., 1968 |

References

Loudon, Maccoll, et al., 1968
Loudon, A.G.; Maccoll, A.; Webb, K.S.,
Charge location and fragmentation in mass spectrometry. II. The mass spectra and ionization potentials of some methylguanidines,
Advan. Mass Spectrom., 1968, 4, 223. [all data]