Silane, [thiobis(methylene)]bis[thiomethyl-
- Formula: C8H22SSi2
- Molecular weight: 206.496
- IUPAC Standard InChIKey: GISUCMFTNKRCPF-UHFFFAOYSA-N
- CAS Registry Number: 4712-51-0
- Chemical structure:
View 3d structure (requires JavaScript / HTML 5) - Permanent link for this species. Use this link for bookmarking this species for future reference.

Gas phase ion energetics data

Data compiled by: Sharon G. Lias and Joel F. Liebman
Ionization energy determinations
IE (eV) | Method | Reference | Comment |
---|---|---|---|
7.6 | PE | Bock, Meuret, et al., 1990 | |
8.03 | PE | Bock, Meuret, et al., 1990 | Vertical value |

References

Bock, Meuret, et al., 1990
Bock, H.; Meuret, J.; Stein, U.,
Photoelectron spectra and molecular properties. CXXII. The low first ionization energies of the β-trimethylsilyl substituted sulfides (H3C)3SiH2CSCH2Si(CH3)3 and ((H3C)3Si)3CSCH3 and their rationalization,
J. Org. Chem., 1990, 398, 65. [all data]