Propiolic acid
- Formula: C3H2O2
- Molecular weight: 70.0468
- IUPAC Standard InChIKey: UORVCLMRJXCDCP-UHFFFAOYSA-N
- CAS Registry Number: 471-25-0
- Chemical structure:
View 3d structure (requires JavaScript / HTML 5) - Other names: HC≡CCOOH; Acetylenecarboxylic acid; Propynoic acid; 2-Propynoic acid; Carboxyacetylene; Propargylic acid; Propinoic acid

Phase change data

Data compiled by: Robert L. Brown and Stephen E. Stein
Reduced pressure boiling point
Tboil (K) | Pressure (bar) | Reference |
---|---|---|
375.2 | 0.267 | Aldrich Chemical Company Inc., 1990 |
337.6 | 0.020 | Farchan Laboratories, 1990 |

Gas phase ion energetics data

Data compiled as indicated in comments:
LLK - Sharon G. Lias, Rhoda D. Levin, and Sherif A. Kafafi
LBLHLM - Sharon G. Lias, John E. Bartmess, Joel F. Liebman, John L. Holmes, Rhoda D. Levin, and W. Gary Mallard
Ionization energy determinations
IE (eV) | Method | Reference | Comment |
---|---|---|---|
10.45 | PE | Von Niessen, Bieri, et al., 1980 | LLK |
10.9 | PE | Von Niessen, Bieri, et al., 1980 | Vertical value; LLK |
Appearance energy determinations
Ion | AE (eV) | Other Products | Method | Reference | Comment |
---|---|---|---|---|---|
C2H2O+[HCCOH+] | 11.4 ± 0.2 | CO | EI | Van Baar, Weiske, et al., 1986 | LBLHLM |

Normal alkane RI, non-polar column, custom temperature program

Column type | Active phase | I | Reference | Comment |
---|---|---|---|---|
Capillary | Methyl Silicone | 660. | Zenkevich, 1996 | Program: not specified |

Normal alkane RI, polar column, temperature ramp

Column type | Active phase | I | Reference | Comment |
---|---|---|---|---|
Capillary | TC-Wax | 1538. | Miyazawa and Okuno, 2003 | He, 4. K/min, 250. C @ 30. min; Column length: 60. m; Column diameter: 0.25 mm; Tstart: 80. C |

References

Aldrich Chemical Company Inc., 1990
Aldrich Chemical Company Inc.,
Catalog Handbook of Fine Chemicals, Aldrich Chemical Company, Inc., Milwaukee WI, 1990, 1. [all data]
Farchan Laboratories, 1990
Farchan Laboratories,
Research Chemicals Catalog, Farchan Laboratories, Gainesville, FL, 1990, 91. [all data]
Von Niessen, Bieri, et al., 1980
Von Niessen, W.; Bieri, G.; Asbrink, L.,
30.4 nm He(II) photoelectron spectra of organic molecules. Part III. Oxo-compounds (C,H,O),
J. Electron Spectrosc. Relat. Phenom., 1980, 21, 175. [all data]
Van Baar, Weiske, et al., 1986
Van Baar, B.; Weiske, T.; Terlouw, J.; Schwarz, H.,
Hydroxyacetylene: Generation and characterization of the neutral molecule, radical cation and dication in the gas phase,
Angew. Chem. Int. Ed. Engl., 1986, 25, 282. [all data]
Zenkevich, 1996
Zenkevich, I.G.,
Informational Maitenance of Gas Chromatographic Identification of Organic Compounds in Ecoanalytical Investigations,
Z. Anal. Chem., 1996, 51, 11, 1140-1148. [all data]
Miyazawa and Okuno, 2003
Miyazawa, M.; Okuno, Y.,
Volatile components from the roots of Scrophularia ningpoensis Hemsl.,
Flavour Fragr. J., 2003, 18, 5, 398-400, https://doi.org/10.1002/ffj.1232
. [all data]