Naphthalene,decahydro-1-methyl-(1α,4aα,8aβ
- Formula: C11H20
- Molecular weight: 152.2765
- IUPAC Standard InChIKey: NHCREQREVZBOCH-GMTAPVOTSA-N
- CAS Registry Number: 4683-95-8
- Chemical structure:
View 3d structure (requires JavaScript / HTML 5) - Stereoisomers:
- Naphthalene,decahydro-1-methyl-(1α,4aβ,8aα
- 1-Methyldecahydronaphthalene
- cis-Decalin, trans-1e-methyl, r-9H
- trans-Decalin, 1a-methyl
- trans-Decalin, 1e-methyl
- cis,cis-Bicyclo[4.4.0]decane, 2-methyl
- cis,trans-Bicyclo[4.4.0]decane, 2-methyl
- trans,cis-Bicyclo[4.4.0]decane, 2-methyl
- trans,trans-Bicyclo[4.4.0]decane, 2-methyl
- 1-Methyldecalin, cis
- 1-Methyldecalin, trans

Gas phase ion energetics data

Data compiled by: Sharon G. Lias, Rhoda D. Levin, and Sherif A. Kafafi
Ionization energy determinations
IE (eV) | Method | Reference |
---|---|---|
9.27 ± 0.009 | EI | Zaikin, Musaev, et al., 1978 |
Appearance energy determinations
Ion | AE (eV) | Other Products | Method | Reference | Comment |
---|---|---|---|---|---|
C10H17+ | 10.13 ± 0.007 | CH3 | EI | Zaikin, Musaev, et al., 1978 |

References

Zaikin, Musaev, et al., 1978
Zaikin, V.G.; Musaev, I.A.; Kurashova, E.K.,
Ionization and appearance potentials in organic chemistry,
Org. Mass Spectrom., 1978, 13, 685. [all data]