Tetraethyldistibine
- Formula: C8H20Sb2
- Molecular weight: 359.764
- IUPAC Standard InChIKey: AZORYECNPXIPBP-UHFFFAOYSA-N
- CAS Registry Number: 4669-92-5
- Chemical structure:
View 3d structure (requires JavaScript / HTML 5) - Permanent link for this species. Use this link for bookmarking this species for future reference.

Gas phase ion energetics data

Data compiled by: Henry M. Rosenstock, Keith Draxl, Bruce W. Steiner, and John T. Herron
Ionization energy determinations
IE (eV) | Method | Reference |
---|---|---|
8.3 ± 0.3 | EI | Bogolyubov, Grishin, et al., 1969 |
Appearance energy determinations
Ion | AE (eV) | Other Products | Method | Reference | Comment |
---|---|---|---|---|---|
C2H5Sb+ | 10.7 ± 0.3 | ? | EI | Bogolyubov, Grishin, et al., 1969 | |
C2H5Sb2+ | 14.4 ± 0.3 | ? | EI | Bogolyubov, Grishin, et al., 1969 | |
C2H6Sb2+ | 13.5 ± 0.3 | ? | EI | Bogolyubov, Grishin, et al., 1969 | |
C4H11Sb+ | 9.0 ± 0.3 | ? | EI | Bogolyubov, Grishin, et al., 1969 | |
C4H11Sb2+ | 11.5 ± 0.3 | ? | EI | Bogolyubov, Grishin, et al., 1969 | |
C6H15Sb2+ | 9.6 ± 0.3 | ? | EI | Bogolyubov, Grishin, et al., 1969 | |
SbH+ | 16.2 ± 0.3 | ? | EI | Bogolyubov, Grishin, et al., 1969 | |
Sb2H+ | 18.9 ± 0.3 | ? | EI | Bogolyubov, Grishin, et al., 1969 | |
SbH2+ | 15.2 ± 0.3 | ? | EI | Bogolyubov, Grishin, et al., 1969 | |
Sb2H2+ | 15.4 ± 0.3 | ? | EI | Bogolyubov, Grishin, et al., 1969 | |
Sb2H3+ | 17.5 ± 0.3 | ? | EI | Bogolyubov, Grishin, et al., 1969 | |
Sb+ | 18.5 ± 0.3 | ? | EI | Bogolyubov, Grishin, et al., 1969 | |
Sb2+ | 18.2 ± 0.3 | ? | EI | Bogolyubov, Grishin, et al., 1969 |

References

Bogolyubov, Grishin, et al., 1969
Bogolyubov, G.M.; Grishin, N.N.; Petrov, A.A.,
Organic derivatives of group V and group VI elements. X. Mass spectra of tetraethyldistibine, diethyl diselenide, diethyl ditelluride, and the corresponding monoderivatives. Interpretation of mass-spectral intensities,
Zh. Obshch. Khim., 1969, 39, 2244, In original 2190. [all data]