Silane, chlorotriethoxy-
- Formula: C6H15ClO3Si
- Molecular weight: 198.720
- IUPAC Standard InChIKey: JEZFASCUIZYYEV-UHFFFAOYSA-N
- CAS Registry Number: 4667-99-6
- Chemical structure:
View 3d structure (requires JavaScript / HTML 5) - Other names: Triethoxychlorosilane; Chloro(triethoxy)silane; Silane, triethoxy, chloro

Gas phase ion energetics data

Data compiled by: Sharon G. Lias, Rhoda D. Levin, and Sherif A. Kafafi
Ionization energy determinations
IE (eV) | Method | Reference | Comment |
---|---|---|---|
10.52 | PE | Green, Lappert, et al., 1971 | Vertical value |

Kovats' RI, non-polar column, isothermal

View large format table.

Column type Active phase Temperature (C) I Reference Comment
PackedSE-30100.920.Kreshkov, Kirichenko, et al., 1975Ar; Column length: 1. m
PackedSE-30150.916.Kreshkov, Kirichenko, et al., 1975Ar; Column length: 1. m

Normal alkane RI, non-polar column, custom temperature program

View large format table.

Column type Active phase I Reference Comment
PackedSE-30920.Yu and Yang, 2005Program: not specified

References

Green, Lappert, et al., 1971
Green, M.C.; Lappert, M.F.; Pedley, J.B.; Schmidt, W.; Wilkins, B.T.,
Photoelectron spectra energy level trends in MenSiCl4-n and related series,
J. Organomet. Chem., 1971, 31, 55. [all data]