Dichloro(diethoxy)silane
- Formula: C4H10Cl2O2Si
- Molecular weight: 189.112
- IUPAC Standard InChIKey: UFCXHBIETZKGHB-UHFFFAOYSA-N
- CAS Registry Number: 4667-38-3
- Chemical structure:
View 3d structure (requires JavaScript / HTML 5) - Other names: Silane, dichlorodiethoxy-

Gas phase ion energetics data

Data compiled by: Sharon G. Lias, Rhoda D. Levin, and Sherif A. Kafafi
Ionization energy determinations
IE (eV) | Method | Reference | Comment |
---|---|---|---|
10.78 | PE | Green, Lappert, et al., 1971 | Vertical value |

References

Green, Lappert, et al., 1971
Green, M.C.; Lappert, M.F.; Pedley, J.B.; Schmidt, W.; Wilkins, B.T.,
Photoelectron spectra energy level trends in MenSiCl4-n and related series,
J. Organomet. Chem., 1971, 31, 55. [all data]