Bis(trimethylsilyl)mercury
- Formula: C6H18HgSi2
- Molecular weight: 346.97
- IUPAC Standard InChIKey: RKCQQCXHUWKHGR-UHFFFAOYSA-N
- CAS Registry Number: 4656-04-6
- Chemical structure:
View 3d structure (requires JavaScript / HTML 5) - Permanent link for this species. Use this link for bookmarking this species for future reference.

Gas phase ion energetics data

Data compiled by: Henry M. Rosenstock, Keith Draxl, Bruce W. Steiner, and John T. Herron
Appearance energy determinations
Ion | AE (eV) | Other Products | Method | Reference | Comment |
---|---|---|---|---|---|
C3H9Si+ | 8.6 ± 0.1 | ? | EI | Connor, Finney, et al., 1966 |

References

Connor, Finney, et al., 1966
Connor, J.A.; Finney, G.; Leigh, G.J.; Haszeldine, R.N.; Robinson, P.J.; Sedgwick, R.D.; Simmons, R.F.,
Bond dissociation energies in organosilicon compounds,
Chem. Commun., 1966, 178. [all data]