Azidotrimethylsilane
- Formula: C3H9N3Si
- Molecular weight: 115.2092
- IUPAC Standard InChIKey: SEDZOYHHAIAQIW-UHFFFAOYSA-N
- CAS Registry Number: 4648-54-8
- Chemical structure:
View 3d structure (requires JavaScript / HTML 5) - Other names: Trimethylsilylazide; Silane, azidotrimethyl-; (CH3)3SiN3

Gas phase ion energetics data

Data compiled by: Sharon G. Lias, Rhoda D. Levin, and Sherif A. Kafafi
Ionization energy determinations
IE (eV) | Method | Reference | Comment |
---|---|---|---|
8.69 | PE | Gibbins, Lappert, et al., 1975 | Vertical value |
9.7 ± 0.1 | PE | Cradock, Ebsworth, et al., 1972 | Vertical value |

Phase change data

Data compiled by: Robert L. Brown and Stephen E. Stein

Quantity Value Units Method Reference Comment
Tfus178.KN/ABuckingham and Donaghy, 1982

Reduced pressure boiling point

Tboil (K) Pressure (atm) Reference
325. - 326.0.230PCR Inc., 1990
368.0.947Buckingham and Donaghy, 1982
325. - 326.0.230Buckingham and Donaghy, 1982

References

Gibbins, Lappert, et al., 1975
Gibbins, S.G.; Lappert, M.F.; Pedley, J.B.; Sharp, G.J.,
Bonding studies of transition-metal complexes. Part II. Helium-I photoelectron spectra of homoleptic d0, d1, and d10 tetrakis(dialkylamides) of transition group 4B metals tungsten hexakis(dimethylamide),
J. Chem. Soc. Dalton Trans., 1975, 72. [all data]
Cradock, Ebsworth, et al., 1972
Cradock, S.; Ebsworth, E.A.V.; Savage, W.J.; Whiteford, R.A.,
Photoelectron spectra of some methyl, silyl and germyl amines, phosphines and arsines,
J. Chem. Soc. Faraday Trans. 2, 1972, 68, 934. [all data]