Bicyclo[4.1.0]hepta-1,3,5-triene
- Formula: C7H6
- Molecular weight: 90.1225
- IUPAC Standard InChIKey: AMSMVCOBCOZLEE-UHFFFAOYSA-N
- CAS Registry Number: 4646-69-9
- Chemical structure:
View 3d structure (requires JavaScript / HTML 5) - Other names: 1,3,5-Norcaratriene; Benzocyclopropene; Cyclopropabenzene

Reaction thermochemistry data

Data compiled by: Hussein Y. Afeefy, Joel F. Liebman, and Stephen E. Stein
Individual Reactions
By formula: C7H6 + CH4O = C8H10O
Quantity | Value | Units | Method | Reference | Comment |
---|---|---|---|---|---|
ΔrH° | -214. | kJ/mol | Cm | Billups, Chow, et al., 1973 | liquid phase; solvent: Methanol |

Gas phase ion energetics data

Data compiled as indicated in comments:
LL - Sharon G. Lias and Joel F. Liebman
LLK - Sharon G. Lias, Rhoda D. Levin, and Sherif A. Kafafi
Ionization energy determinations
IE (eV) | Method | Reference | Comment |
---|---|---|---|
8.82 | PE | Lecoultre, Heilbronner, et al., 1988 | Vertical value; LL |
8.82 | PE | Brogli, Giovannini, et al., 1973 | Vertical value; LLK |

References

Billups, Chow, et al., 1973
Billups, W.E.; Chow, W.Y.; Leavell, K.H.; Lewis, E.S.; Margrave, J.L.; Sass, R.L.; Shieh, J.J.; Werness, P.G.; Wood, J.L.,
Structure and thermochemistry of benzocyclopropenes. Bond fixation and strain energy,
J. Am. Chem. Soc., 1973, 95, 7878-7880. [all data]
Lecoultre, Heilbronner, et al., 1988
Lecoultre, J.; Heilbronner, E.; Muller, P.; Rodriguez, D.,
The influence of fluoro substituents on cyclopropa, -benzene, -naphthalene, and -anthracene,
Collect. Czech. Chem. Commun., 1988, 53, 2385. [all data]
Brogli, Giovannini, et al., 1973
Brogli, F.; Giovannini, E.; Heilbronner, E.; Schurter, R.,
Die photoelektronen spektren der benzocycloalkene,
Chem. Ber., 1973, 106, 961. [all data]