Neopentane
- Formula: C5H12
- Molecular weight: 72.1488
- IUPAC Standard InChIKey: CRSOQBOWXPBRES-UHFFFAOYSA-N
- CAS Registry Number: 463-82-1
- Chemical structure:

Gas phase thermochemistry data

Data compiled as indicated in comments:
ALS - Hussein Y. Afeefy, Joel F. Liebman, and Stephen E. Stein
GT - Glushko Thermocenter, Russian Academy of Sciences, Moscow
Quantity | Value | Units | Method | Reference | Comment |
---|---|---|---|---|---|
ΔfH°gas | -167.9 ± 0.63 | kJ/mol | Ccb | Good, 1970 | ALS |
ΔfH°gas | -168.5 ± 1.0 | kJ/mol | Cm | Pilcher and Chadwick, 1967 | ALS |
ΔfH°gas | -166.0 ± 1.0 | kJ/mol | Ccb | Prosen and Rossini, 1945 | ALS |
Quantity | Value | Units | Method | Reference | Comment |
ΔcH°gas | -3514.1 ± 0.96 | kJ/mol | Cm | Pilcher and Chadwick, 1967 | Corresponding ΔfHºgas = -168.5 kJ/mol (simple calculation by NIST; no Washburn corrections); ALS |
Constant pressure heat capacity of gas
Cp,gas (J/mol*K) | Temperature (K) | Reference | Comment |
---|---|---|---|
120.82 ± 0.25 | 298.15 | Hossenlopp I.A., 1981 | GT |
129.58 ± 0.26 | 323.15 | ||
138.41 ± 0.28 | 348.15 | ||
147.06 ± 0.29 | 373.15 | ||
155.46 ± 0.31 | 398.15 | ||
163.52 ± 0.32 | 423.15 | ||
171.46 ± 0.34 | 448.15 | ||
178.95 ± 0.36 | 473.15 | ||
186.42 ± 0.37 | 498.15 | ||
193.38 ± 0.39 | 523.15 |
Constant pressure heat capacity of gas
Cp,gas (J/mol*K) | Temperature (K) | Reference | Comment |
---|---|---|---|
80.54 | 200. | Scott D.W., 1974 | Recommended values were obtained from the consistent correlation scheme for alkanes [ Scott D.W., 1974, 2, Scott D.W., 1974]. This approach gives a better agreement with experimental data than the statistical thermodynamics calculation [ Pitzer K.S., 1946].; GT |
111.63 | 273.15 | ||
120.83 ± 0.25 | 298.15 | ||
121.55 | 300. | ||
155.98 | 400. | ||
186.98 | 500. | ||
214.64 | 600. | ||
238.91 | 700. | ||
261.08 | 800. | ||
280.33 | 900. | ||
297.90 | 1000. | ||
313.38 | 1100. | ||
327.19 | 1200. | ||
338.90 | 1300. | ||
351.46 | 1400. | ||
359.82 | 1500. |

Reaction thermochemistry data

Data compiled as indicated in comments:
B - John E. Bartmess
MS - José A. Martinho Simões
Individual Reactions
C5H11- + =
By formula: C5H11- + H+ = C5H12
Quantity | Value | Units | Method | Reference | Comment |
---|---|---|---|---|---|
ΔrH° | 1711. ± 8.4 | kJ/mol | Bran | DePuy, Gronert, et al., 1989 | gas phase; B |
ΔrH° | 1720. ± 42. | kJ/mol | CIDT | Graul and Squires, 1990 | gas phase; B |
Quantity | Value | Units | Method | Reference | Comment |
ΔrG° | 1674. ± 8.8 | kJ/mol | H-TS | DePuy, Gronert, et al., 1989 | gas phase; B |
C10H22Mg (cr) + (g) + (l) = 2 (l) + Br2Mg (cr)
By formula: C10H22Mg (cr) + H2 (g) + Br2 (l) = 2C5H12 (l) + Br2Mg (cr)
Quantity | Value | Units | Method | Reference | Comment |
---|---|---|---|---|---|
ΔrH° | -669.6 ± 6.6 | kJ/mol | RSC | Akkerman, Schat, et al., 1983 | MS |

Gas phase ion energetics data

Data evaluated as indicated in comments:
L - Sharon G. Lias
Data compiled as indicated in comments:
B - John E. Bartmess
LLK - Sharon G. Lias, Rhoda D. Levin, and Sherif A. Kafafi
RDSH - Henry M. Rosenstock, Keith Draxl, Bruce W. Steiner, and John T. Herron
Quantity | Value | Units | Method | Reference | Comment |
---|---|---|---|---|---|
IE (evaluated) | ≤10.30 ± 0.08 | eV | N/A | N/A | L |
Ionization energy determinations
IE (eV) | Method | Reference | Comment |
---|---|---|---|
10.21 ± 0.04 | PE | Jonas, Schweitzer, et al., 1973 | LLK |
10.3 ± 0.1 | PE | Evans, Green, et al., 1972 | LLK |
10.40 | PE | Dewar and Worley, 1969 | RDSH |
10.35 | PI | Watanabe, Nakayama, et al., 1962 | RDSH |
10.90 | PE | Kimura, Katsumata, et al., 1981 | Vertical value; LLK |
10.9 ± 0.1 | PE | Bieri, Burger, et al., 1977 | Vertical value; LLK |
11.3 | PE | Schmidt and Wilkins, 1972 | Vertical value; LLK |
11.3 | PE | Murrell and Schmidt, 1972 | Vertical value; LLK |
Appearance energy determinations
Ion | AE (eV) | Other Products | Method | Reference | Comment |
---|---|---|---|---|---|
CH3+ | 29.5 ± 0.2 | ? | EI | Olmsted, Street, et al., 1964 | RDSH |
CH3+ | 13.14 | ? | EI | Lampe and Field, 1959 | RDSH |
C2H3+ | 17.95 | ? | EI | Lampe and Field, 1959 | RDSH |
C2H5+ | 13.81 | ? | EI | Lampe and Field, 1959 | RDSH |
C3H3+ | 17.08 | ? | EI | Lampe and Field, 1959 | RDSH |
C3H5+ | 13.13 | ? | EI | Lampe and Field, 1959 | RDSH |
C4H8+ | 10.39 ± 0.02 | CH4 | PI | Steiner, Giese, et al., 1961 | RDSH |
C4H9+ | 10.35 | CH3 | PI | Chesnavich, Su, et al., 1978 | LLK |
C4H9+ | 10.56 | CH3 | EI | Lossing and Semeluk, 1970 | RDSH |
C4H9+ | 10.57 ± 0.02 | CH3 | PI | Steiner, Giese, et al., 1961 | RDSH |
De-protonation reactions
C5H11- + =
By formula: C5H11- + H+ = C5H12
Quantity | Value | Units | Method | Reference | Comment |
---|---|---|---|---|---|
ΔrH° | 1711. ± 8.4 | kJ/mol | Bran | DePuy, Gronert, et al., 1989 | gas phase; B |
ΔrH° | 1720. ± 42. | kJ/mol | CIDT | Graul and Squires, 1990 | gas phase; B |
Quantity | Value | Units | Method | Reference | Comment |
ΔrG° | 1674. ± 8.8 | kJ/mol | H-TS | DePuy, Gronert, et al., 1989 | gas phase; B |

Kovats' RI, non-polar column, isothermal

Column type | Active phase | Temperature (C) | I | Reference | Comment |
---|---|---|---|---|---|
Capillary | Squalane | 100. | 413. | Heinzen, Soares, et al., 1999 | |
Capillary | Squalane | 50. | 412.5 | Bajus, Veselý, et al., 1979 | Column length: 100. m; Column diameter: 0.25 mm |
Capillary | Squalane | 60. | 413. | Chretien and Dubois, 1976 | |
Packed | Apolane | 110. | 408.8 | Riedo, Fritz, et al., 1976 | He, Chromosorb; Column length: 2.4 m |
Packed | Apolane | 130. | 409.8 | Riedo, Fritz, et al., 1976 | He, Chromosorb; Column length: 2.4 m |
Packed | Apolane | 150. | 410.6 | Riedo, Fritz, et al., 1976 | He, Chromosorb; Column length: 2.4 m |
Packed | Apolane | 170. | 411.3 | Riedo, Fritz, et al., 1976 | He, Chromosorb; Column length: 2.4 m |
Packed | Apolane | 190. | 411.8 | Riedo, Fritz, et al., 1976 | He, Chromosorb; Column length: 2.4 m |
Packed | Apolane | 210. | 412.1 | Riedo, Fritz, et al., 1976 | He, Chromosorb; Column length: 2.4 m |
Packed | Apolane | 230. | 412.3 | Riedo, Fritz, et al., 1976 | He, Chromosorb; Column length: 2.4 m |
Packed | Apolane | 90. | 407.6 | Riedo, Fritz, et al., 1976 | He, Chromosorb; Column length: 2.4 m |
Capillary | Squalane | 50. | 412. | Rijks and Cramers, 1974 | N2; Column length: 100. m; Column diameter: 0.25 mm |
Capillary | Squalane | 70. | 413. | Rijks and Cramers, 1974 | N2; Column length: 100. m; Column diameter: 0.25 mm |
Packed | Squalane | 27. | 411. | Hively and Hinton, 1968 | He, Chromosorb P; Column length: 15. m; Column diameter: 0.25 mm |
Packed | Squalane | 49. | 413. | Hively and Hinton, 1968 | He, Chromosorb P; Column length: 15. m; Column diameter: 0.25 mm |
Packed | Squalane | 67. | 413. | Hively and Hinton, 1968 | He, Chromosorb P; Column length: 15. m; Column diameter: 0.25 mm |
Packed | Squalane | 86. | 413. | Hively and Hinton, 1968 | He, Chromosorb P; Column length: 15. m; Column diameter: 0.25 mm |
Capillary | Squalane | 30. | 411. | Tourres, 1967 | H2; Column length: 100. m; Column diameter: 0.25 mm |
Capillary | Squalane | 50. | 412. | Tourres, 1967 | H2; Column length: 100. m; Column diameter: 0.25 mm |
Capillary | Squalane | 70. | 413. | Tourres, 1967 | H2; Column length: 100. m; Column diameter: 0.25 mm |
Packed | Squalane | 26. | 412. | Zulaïca and Guiochon, 1966 | Column length: 10. m |

Kovats' RI, non-polar column, custom temperature program

Column type | Active phase | I | Reference | Comment |
---|---|---|---|---|
Capillary | Petrocol DH-100 | 415.3 | Haagen-Smit Laboratory, 1997 | He; Column length: 100. m; Column diameter: 0.2 mm; Program: 5C(10min) => 5C/min => 50C(48min) => 1.5C/min => 195C(91min) |

Van Den Dool and Kratz RI, non-polar column, temperature ramp

Column type | Active phase | I | Reference | Comment |
---|---|---|---|---|
Capillary | Petrocol DH | 408.4 | Censullo, Jones, et al., 2003 | 50. m/0.25 mm/0.5 μm, He, 35. C @ 10. min, 3. K/min, 200. C @ 10. min |

Normal alkane RI, non-polar column, isothermal

Column type | Active phase | Temperature (C) | I | Reference | Comment |
---|---|---|---|---|---|
Capillary | Methyl Silicone | 50. | 412. | N/A | N2; Column length: 74.6 m; Column diameter: 0.28 mm |

Normal alkane RI, non-polar column, temperature ramp

Column type | Active phase | I | Reference | Comment |
---|---|---|---|---|
Capillary | Polydimethyl siloxane: CP-Sil 5 CB | 414. | Bramston-Cook, 2013 | 60. m/0.25 mm/1.0 μm, Helium, 45. C @ 1.45 min, 3.6 K/min, 210. C @ 2.72 min |
Capillary | Petrocol DH | 414. | Supelco, 2012 | 100. m/0.25 mm/0.50 μm, Helium, 20. C @ 15. min, 15. K/min, 220. C @ 30. min |
Capillary | HP-5 MS | 412. | Zenkevich, Makarov A.A., et al., 2009 | 30. m/0.25 mm/0.25 μm, Helium, 2. K/min, 220. C @ 10. min; Tstart: 50. C |

Normal alkane RI, non-polar column, custom temperature program

Column type | Active phase | I | Reference | Comment |
---|---|---|---|---|
Capillary | Methyl Silicone | 413. | Chen and Feng, 2007 | Program: not specified |
Capillary | Methyl Silicone | 412. | Feng and Mu, 2007 | Program: not specified |
Capillary | OV-101 | 413. | Du and Liang, 2003 | Program: not specified |
Capillary | Polydimethyl siloxane | 413. | Junkes, Castanho, et al., 2003 | Program: not specified |
Capillary | PONA | 415. | Perkin Elmer Instruments, 2002 | Column length: 100. m; Phase thickness: 0.50 μm; Program: not specified |
Capillary | SPB-1 | 409. | Flanagan, Streete, et al., 1997 | 60. m/0.53 mm/5. μm, He; Program: 40C(6min) => 5C/min => 80C => 10C/min => 200C |
Capillary | SPB-1 | 409. | Strete, Ruprah, et al., 1992 | 60. m/0.53 mm/5.0 μm, Helium; Program: 40 0C (6 min) 5 0C/min -> 80 0C 10 0C/min -> 200 0C |
Packed | SE-30 | 415. | Robinson and Odell, 1971 | N2, Chromosorb W; Column length: 6.1 m; Program: 50C910min) => 20C/min => 90(6min) => 10C/min => 150C(hold) |

Condensed phase thermochemistry data

Data compiled as indicated in comments:
ALS - Hussein Y. Afeefy, Joel F. Liebman, and Stephen E. Stein
DH - Eugene S. Domalski and Elizabeth D. Hearing
Quantity | Value | Units | Method | Reference | Comment |
---|---|---|---|---|---|
ΔfH°liquid | -45.49 ± 0.15 | kcal/mol | Ccb | Good, 1970 | ALS |
ΔfH°liquid | -44.98 ± 0.25 | kcal/mol | Ccb | Prosen and Rossini, 1945 | ALS |
Quantity | Value | Units | Method | Reference | Comment |
ΔcH°liquid | -834.71 ± 0.14 | kcal/mol | Ccb | Good, 1970 | Reanalyzed by Pedley, Naylor, et al., 1986, Original value = -834.66 ± 0.12 kcal/mol; Corresponding ΔfHºliquid = -45.44 kcal/mol (simple calculation by NIST; no Washburn corrections); ALS |
ΔcH°liquid | -835.18 ± 0.24 | kcal/mol | Ccb | Prosen and Rossini, 1945 | Corresponding ΔfHºliquid = -44.97 kcal/mol (simple calculation by NIST; no Washburn corrections); ALS |
Quantity | Value | Units | Method | Reference | Comment |
S°liquid | 51.819 | cal/mol*K | N/A | Enokida, Shinoda, et al., 1969 | At normal boiling point.; DH |
S°liquid | 52.29 | cal/mol*K | N/A | Aston and Messerly, 1936 | DH |
Constant pressure heat capacity of liquid
Cp,liquid (cal/mol*K) | Temperature (K) | Reference | Comment |
---|---|---|---|
36.589 | 259.93 | Enokida, Shinoda, et al., 1969 | T = 4 to 260 K. Value is unsmoothed experimental datum.; DH |
39.171 | 278.92 | Aston and Messerly, 1936 | T = 13 to 283 K. Value is unsmoothed experimental datum.; DH |

Phase change data

Data compiled as indicated in comments:
BS - Robert L. Brown and Stephen E. Stein
TRC - Thermodynamics Research Center, NIST Boulder Laboratories, Chris Muzny director
AC - William E. Acree, Jr., James S. Chickos
ALS - Hussein Y. Afeefy, Joel F. Liebman, and Stephen E. Stein
DH - Eugene S. Domalski and Elizabeth D. Hearing
CAL - James S. Chickos, William E. Acree, Jr., Joel F. Liebman, Students of Chem 202 (Introduction to the Literature of Chemistry), University of Missouri -- St. Louis
Quantity | Value | Units | Method | Reference | Comment |
---|---|---|---|---|---|
Tboil | 282.6 ± 0.5 | K | AVG | N/A | Average of 17 values; Individual data points |
Quantity | Value | Units | Method | Reference | Comment |
Tfus | 255. ± 3. | K | AVG | N/A | Average of 8 values; Individual data points |
Quantity | Value | Units | Method | Reference | Comment |
Ttriple | 256.76 | K | N/A | Enokido, Shinoda, et al., 1969 | Crystal phase 1 phase; Uncertainty assigned by TRC = 0.02 K; TRC |
Ttriple | 256.77 | K | N/A | Streiff, 1964 | Crystal phase 1 phase; Uncertainty assigned by TRC = 0.03 K; TRC |
Ttriple | 256.53 | K | N/A | Aston and Messerly, 1936, 2 | Crystal phase 1 phase; Uncertainty assigned by TRC = 0.02 K; TRC |
Quantity | Value | Units | Method | Reference | Comment |
Tc | 433.8 ± 0.1 | K | N/A | Daubert, 1996 | |
Tc | 433.8 | K | N/A | Majer and Svoboda, 1985 | |
Tc | 433.8 | K | N/A | Dawson, Silberberg, et al., 1973 | Uncertainty assigned by TRC = 0.2 K; TRC |
Tc | 433.75 | K | N/A | Partington, Rowlinson, et al., 1960 | Uncertainty assigned by TRC = 0.1 K; Visual, THg; TRC |
Tc | 433.75 | K | N/A | Beattie, Douslin, et al., 1951 | Uncertainty assigned by TRC = 0.2 K; TRC |
Quantity | Value | Units | Method | Reference | Comment |
Pc | 31.54 ± 0.1 | atm | N/A | Daubert, 1996 | |
Pc | 31.545 | atm | N/A | Dawson, Silberberg, et al., 1973 | Uncertainty assigned by TRC = 0.09998 atm; TRC |
Pc | 31.57 | atm | N/A | Beattie, Douslin, et al., 1951 | Uncertainty assigned by TRC = 0.2000 atm; TRC |
Quantity | Value | Units | Method | Reference | Comment |
Vc | 0.307 | l/mol | N/A | Daubert, 1996 | |
Vc | 0.304 | l/mol | N/A | Beattie, Douslin, et al., 1951 | Uncertainty assigned by TRC = 0.004 l/mol; TRC |
Quantity | Value | Units | Method | Reference | Comment |
ρc | 3.26 ± 0.01 | mol/l | N/A | Daubert, 1996 | |
ρc | 3.214 | mol/l | N/A | Dawson, Silberberg, et al., 1973 | Uncertainty assigned by TRC = 0.03 mol/l; TRC |
Quantity | Value | Units | Method | Reference | Comment |
ΔvapH° | 5.351 | kcal/mol | N/A | Majer and Svoboda, 1985 | |
ΔvapH° | 5.21 | kcal/mol | C | Hossenlopp and Scott, 1981 | AC |
ΔvapH° | 5.222 | kcal/mol | N/A | Reid, 1972 | AC |
ΔvapH° | 5.35 ± 0.14 | kcal/mol | V | Good, 1970 | ALS |
Enthalpy of vaporization
ΔvapH (kcal/mol) | Temperature (K) | Method | Reference | Comment |
---|---|---|---|---|
5.435 | 282.7 | N/A | Majer and Svoboda, 1985 | |
5.4381 | 282.61 | N/A | Aston and Messerly, 1936 | P = 101.325 kPa; DH |
5.81 | 272. | N/A | Höpfner, Parekh, et al., 2010 | Based on data from 257. to 293. K. See also Boublik, Fried, et al., 1984.; AC |
5.74 | 283. | A | Stephenson and Malanowski, 1987 | Based on data from 268. to 313. K.; AC |
5.52 | 327. | A | Stephenson and Malanowski, 1987 | Based on data from 312. to 385. K.; AC |
5.52 | 397. | A | Stephenson and Malanowski, 1987 | Based on data from 382. to 433. K.; AC |
5.31 | 290. | N/A | Das, Reed, et al., 1977 | AC |
4.66 | 330. | N/A | Das, Reed, et al., 1977 | AC |
3.87 | 370. | N/A | Das, Reed, et al., 1977 | AC |
2.65 | 410. | N/A | Das, Reed, et al., 1977 | AC |
5.45 | 358. | N/A | Dawson, Silberberg, et al., 1973 | Based on data from 343. to 433. K. See also Boublik, Fried, et al., 1984.; AC |
5.45 ± 0.02 | 283. | N/A | Aston and Messerly, 1936 | AC |
Enthalpy of vaporization
ΔvapH =
A exp(-βTr) (1 − Tr)β
ΔvapH =
Enthalpy of vaporization (at saturation pressure)
(kcal/mol)
Tr = reduced temperature (T / Tc)
View plot Requires a JavaScript / HTML 5 canvas capable browser.
Temperature (K) | A (kcal/mol) | β | Tc (K) | Reference | Comment |
---|---|---|---|---|---|
264. to 303. | 8.786 | 0.2813 | 433.8 | Majer and Svoboda, 1985 |
Entropy of vaporization
ΔvapS (cal/mol*K) | Temperature (K) | Reference | Comment |
---|---|---|---|
19.24 | 282.61 | Aston and Messerly, 1936 | P; DH |
Antoine Equation Parameters
log10(P) = A − (B / (T + C))
P = vapor pressure (atm)
T = temperature (K)
View plot Requires a JavaScript / HTML 5 canvas capable browser.
Temperature (K) | A | B | C | Reference | Comment |
---|---|---|---|---|---|
205.7 to 293.16 | 3.27962 | 695.152 | -70.679 | Hopfner, Parekh, et al., 1975 | Coefficents calculated by NIST from author's data. |
268.02 to 313.20 | 3.85802 | 950.318 | -36.329 | Osborn and Douslin, 1974 | Coefficents calculated by NIST from author's data. |
343. to 433. | 4.61045 | 1478.868 | 41.256 | Dawson, Silberberg, et al., 1973 | Coefficents calculated by NIST from author's data. |
Enthalpy of sublimation
ΔsubH (kcal/mol) | Temperature (K) | Method | Reference | Comment |
---|---|---|---|---|
6.74 | 241. | N/A | Stephenson and Malanowski, 1987 | Based on data from 223. to 256. K.; AC |
5.71 | 210. | A | Stull, 1947 | Based on data from 171. to 249. K.; AC |
Enthalpy of fusion
ΔfusH (kcal/mol) | Temperature (K) | Reference | Comment |
---|---|---|---|
0.779 | 256.5 | Domalski and Hearing, 1996 | AC |
Entropy of fusion
ΔfusS (cal/mol*K) | Temperature (K) | Reference | Comment |
---|---|---|---|
4.400 | 140. | Domalski and Hearing, 1996 | CAL |
3.033 | 256.5 |
Enthalpy of phase transition
ΔHtrs (kcal/mol) | Temperature (K) | Initial Phase | Final Phase | Reference | Comment |
---|---|---|---|---|---|
0.6286 | 140.5 | crystaline, II | crystaline, I | Chang and Westrum, 1970 | DH |
0.7400 | 256.76 | crystaline, I | liquid | Chang and Westrum, 1970 | DH |
0.62871 | 140. to 142. | crystaline, II | crystaline, I | Enokida, Shinoda, et al., 1969 | DH |
0.74001 | 256.76 | crystaline, I | liquid | Enokida, Shinoda, et al., 1969 | DH |
0.6159 | 140.0 | crystaline, II | crystaline, I | Aston and Messerly, 1936 | DH |
0.7780 | 256.53 | crystaline, I | liquid | Aston and Messerly, 1936 | DH |
Entropy of phase transition
ΔStrs (cal/mol*K) | Temperature (K) | Initial Phase | Final Phase | Reference | Comment |
---|---|---|---|---|---|
4.469 | 140.5 | crystaline, II | crystaline, I | Chang and Westrum, 1970 | DH |
2.880 | 256.76 | crystaline, I | liquid | Chang and Westrum, 1970 | DH |
4.469 | 140. to 142. | crystaline, II, Second | crystaline, I, order transition, 140 to 142 K | Enokida, Shinoda, et al., 1969 | DH |
2.882 | 256.76 | crystaline, I | liquid | Enokida, Shinoda, et al., 1969 | DH |
4.400 | 140.0 | crystaline, II | crystaline, I | Aston and Messerly, 1936 | DH |
3.031 | 256.53 | crystaline, I | liquid | Aston and Messerly, 1936 | DH |

Henry's Law data

Data compiled by: Rolf Sander
Henry's Law constant (water solution)
kH(T) = k°H exp(d(ln(kH))/d(1/T) ((1/T) - 1/(298.15 K)))
k°H = Henry's law constant for solubility in water at 298.15 K (mol/(kg*bar))
d(ln(kH))/d(1/T) = Temperature dependence constant (K)
k°H (mol/(kg*bar)) | d(ln(kH))/d(1/T) (K) | Method | Reference | Comment |
---|---|---|---|---|
0.00047 | Q | N/A | missing citation give several references for the Henry's law constants but don't assign them to specific species. | |
0.00027 | L | N/A | ||
0.00059 | 3400. | L | N/A | |
0.00046 | V | N/A |

References

Good, 1970
Good, W.D.,
The enthalpies of combustion and formation of the isomeric pentanes,
J. Chem. Thermodyn., 1970, 2, 237-244. [all data]
Pilcher and Chadwick, 1967
Pilcher, G.; Chadwick, J.D.M.,
Measurements of heats of combustion by flame calorimetry. Part 4.-n-Pentane, isopentane, neopentane,
Trans. Faraday Soc., 1967, 63, 2357-2361. [all data]
Prosen and Rossini, 1945
Prosen, E.J.; Rossini, F.D.,
Heats of combustion and formation of the paraffin hydrocarbons at 25° C,
J. Res. NBS, 1945, 263-267. [all data]
Hossenlopp I.A., 1981
Hossenlopp I.A.,
Vapor heat capacities and enthalpies of vaporization of five alkane hydrocarbons,
J. Chem. Thermodyn., 1981, 13, 415-421. [all data]
Scott D.W., 1974
Scott D.W.,
Chemical Thermodynamic Properties of Hydrocarbons and Related Substances. Properties of the Alkane Hydrocarbons, C1 through C10 in the Ideal Gas State from 0 to 1500 K. U.S. Bureau of Mines, Bulletin 666, 1974. [all data]
Scott D.W., 1974, 2
Scott D.W.,
Correlation of the chemical thermodynamic properties of alkane hydrocarbons,
J. Chem. Phys., 1974, 60, 3144-3165. [all data]
Pitzer K.S., 1946
Pitzer K.S.,
The entropies and related properties of branched paraffin hydrocarbons,
Chem. Rev., 1946, 39, 435-447. [all data]
DePuy, Gronert, et al., 1989
DePuy, C.H.; Gronert, S.; Barlow, S.E.; Bierbaum, V.M.; Damrauer, R.,
The Gas Phase Acidities of the Alkanes,
J. Am. Chem. Soc., 1989, 111, 6, 1968, https://doi.org/10.1021/ja00188a003
. [all data]
Graul and Squires, 1990
Graul, S.T.; Squires, R.R.,
Gas-Phase Acidities Derived from Threshold Energies for Activated Reactions,
J. Am. Chem. Soc., 1990, 112, 7, 2517, https://doi.org/10.1021/ja00163a007
. [all data]
Akkerman, Schat, et al., 1983
Akkerman, O.S.; Schat, G.; Evers, E.A.I.M.; Bickelhaupt, F.,
Recl. Trav. Chim. Pays-Bas, 1983, 102, 109. [all data]
Jonas, Schweitzer, et al., 1973
Jonas, A.E.; Schweitzer, G.K.; Grimm, F.A.; Carlson, T.A.,
The photoelectron spectra of the tetrafluoro and tetramethyl compounds of the group IV elements,
J. Electron Spectrosc. Relat. Phenom., 1973, 1, 29. [all data]
Evans, Green, et al., 1972
Evans, S.; Green, J.C.; Joachim, P.J.; Orchard, A.F.; Turner, D.W.; Maier, J.P.,
Electronic structures of the Group IVB tetramethyls by helium-(I) photoelectron spectroscopy,
J. Chem. Soc. Faraday Trans. 2, 1972, 68, 905. [all data]
Dewar and Worley, 1969
Dewar, M.J.S.; Worley, S.D.,
Photoelectron spectra of molecules. I. Ionization potentials of some organic molecules and their interpretation,
J. Chem. Phys., 1969, 50, 654. [all data]
Watanabe, Nakayama, et al., 1962
Watanabe, K.; Nakayama, T.; Mottl, J.,
Ionization potentials of some molecules,
J. Quant. Spectry. Radiative Transfer, 1962, 2, 369. [all data]
Kimura, Katsumata, et al., 1981
Kimura, K.; Katsumata, S.; Achiba, Y.; Yamazaki, T.; Iwata, S.,
Ionization energies, Ab initio assignments, and valence electronic structure for 200 molecules
in Handbook of HeI Photoelectron Spectra of Fundamental Organic Compounds, Japan Scientific Soc. Press, Tokyo, 1981. [all data]
Bieri, Burger, et al., 1977
Bieri, G.; Burger, F.; Heilbronner, E.; Maier, J.P.,
Valence ionization enrgies of hydrocarbons,
Helv. Chim. Acta, 1977, 60, 2213. [all data]
Schmidt and Wilkins, 1972
Schmidt, W.; Wilkins, B.T.,
Das "Equivalent Orbital" (EO)-verfahren zur interpretation von photoelektronen(PE)-spektren: Neopentan,
Angew. Chem., 1972, 84, 168. [all data]
Murrell and Schmidt, 1972
Murrell, J.N.; Schmidt, W.,
Photoelectron spectroscopic correlation of the molecular orbitals of methane, ethane, propane, isobutane and neopentane,
J. Chem. Soc. Faraday Trans. 2, 1972, 68, 1709. [all data]
Olmsted, Street, et al., 1964
Olmsted, J., III; Street, K., Jr.; Newton, A.S.,
Excess-kinetic-energy ions in organic mass spectra,
J. Chem. Phys., 1964, 40, 2114. [all data]
Lampe and Field, 1959
Lampe, F.W.; Field, F.H.,
The decomposition of neopentane under electron impact,
J. Am. Chem. Soc., 1959, 81, 3238. [all data]
Steiner, Giese, et al., 1961
Steiner, B.; Giese, C.F.; Inghram, M.G.,
Photoionization of alkanes. Dissociation of excited molecular ions,
J. Chem. Phys., 1961, 34, 189. [all data]
Chesnavich, Su, et al., 1978
Chesnavich, W.J.; Su, T.; Bowers, M.T.,
Reactions of vibrationally excited ions. A theoretical and experimental analysis of the reaction (C4H9+) + NH3 Ü NH4+ + C4H8,
J. Am. Chem. Soc., 1978, 100, 4362. [all data]
Lossing and Semeluk, 1970
Lossing, F.P.; Semeluk, G.P.,
Free radicals by mass spectrometry. XLII.Ionization potentials and ionic heats of formation for C1-C4 alkyl radicals,
Can. J. Chem., 1970, 48, 955. [all data]
Heinzen, Soares, et al., 1999
Heinzen, V.E.F.; Soares, M.F.; Yunes, R.A.,
Semi-empirical topological method for the prediction of the chromatographic retention of cis- and trans-alkene isomers and alkanes,
J. Chromatogr. A, 1999, 849, 2, 495-506, https://doi.org/10.1016/S0021-9673(99)00530-0
. [all data]
Bajus, Veselý, et al., 1979
Bajus, M.; Veselý, V.; Leclercq, P.A.; Rijks, J.A.,
Steam cracking of hydrocarbons. 1. Pyrolysis of heptane,
Ind. Eng. Chem. Prod. Res. Dev., 1979, 18, 1, 30-37, https://doi.org/10.1021/i360069a007
. [all data]
Chretien and Dubois, 1976
Chretien, J.R.; Dubois, J.-E.,
New Perspectives in the Prediction of Kovats Indices,
J. Chromatogr., 1976, 126, 171-189, https://doi.org/10.1016/S0021-9673(01)84071-1
. [all data]
Riedo, Fritz, et al., 1976
Riedo, F.; Fritz, D.; Tarján, G.; Kováts, E.Sz.,
A tailor-made C87 hydrocarbon as a possible non-polar standard stationary phase for gas chromatography,
J. Chromatogr., 1976, 126, 63-83, https://doi.org/10.1016/S0021-9673(01)84063-2
. [all data]
Rijks and Cramers, 1974
Rijks, J.A.; Cramers, C.A.,
High precision capillary gas chromatography of hydrocarbons,
Chromatographia, 1974, 7, 3, 99-106, https://doi.org/10.1007/BF02269819
. [all data]
Hively and Hinton, 1968
Hively, R.A.; Hinton, R.E.,
Variation of the retention index with temperature on squalane substrates,
J. Gas Chromatogr., 1968, 6, 4, 203-217, https://doi.org/10.1093/chromsci/6.4.203
. [all data]
Tourres, 1967
Tourres, D.A.,
Structure moléculaire et rétention en chromatographie en phase gazeuse. Influence de la température sur l'indice de rétention d'alcanes isomères,
J. Chromatogr., 1967, 30, 357-377, https://doi.org/10.1016/S0021-9673(00)84168-0
. [all data]
Zulaïca and Guiochon, 1966
Zulaïca, J.; Guiochon, G.,
Analyse des hauts polymères par chromatographie en phase gazeuse de leurs produits de pyrolyse. II. Application à quelques hydrocarbures macromoléculaires purs,
Bull. Soc. Chim. Fr., 1966, 4, 1351-1363. [all data]
Haagen-Smit Laboratory, 1997
Haagen-Smit Laboratory,
Procedure for the detailed hydrocarbon analysis of gasolines by single column high efficiency (capillary) column gas chromatography, SOP NO. MLD 118, Revision No. 1.1, California Environmental Protection Agency, Air Resources Board, El Monte, California, 1997, 22. [all data]
Censullo, Jones, et al., 2003
Censullo, A.C.; Jones, D.R.; Wills, M.T.,
Speciation of the volatile organic compounds (VOCs) in solventborne aerosol coatings by solid phase microextraction-gas chromatography,
J. Coat. Technol., 2003, 75, 936, 47-53, https://doi.org/10.1007/BF02697922
. [all data]
Bramston-Cook, 2013
Bramston-Cook, R.,
Kovats indices for C2-C13 hydrocarbons and selected oxygenated/halocarbons with 100 % dimethylpolysiloxane columns, 2013, retrieved from http://lotusinstruments.com/monographs/List .... [all data]
Supelco, 2012
Supelco, CatalogNo. 24160-U,
Petrocol DH Columns. Catalog No. 24160-U, 2012, retrieved from http://www.sigmaaldrich.com/etc/medialib/docs/Supelco/Datasheet/1/w97949.Par.0001.File.tmp/w97949.pdf. [all data]
Zenkevich, Makarov A.A., et al., 2009
Zenkevich, I.G.; Makarov A.A.; Schrader, S.; Moeder, M.,
A new version of an additive scheme for the prediction of gas chromatographic retention indices of the 211 structural isomers of 4-nonylphenol,
J. Chromatogr. A, 2009, 1216, 18, 4097-4106, https://doi.org/10.1016/j.chroma.2009.03.021
. [all data]
Chen and Feng, 2007
Chen, Y.; Feng, C.,
QSPR study on gas chromatography retention index of some organic pollutants,
Comput. Appl. Chem. (China), 2007, 24, 10, 1404-1408. [all data]
Feng and Mu, 2007
Feng, H.; Mu, L.-L.,
Quantitative structure-retention relationships for alkane and its derivatives based on electrotopological state index and molecular shape index,
Chem. Ind. Engineering (Chinese), 2007, 24, 2, 161-168. [all data]
Du and Liang, 2003
Du, Y.; Liang, Y.,
Data mining for seeking accurate quantitative relationship between molecular structure and GC retention indices of alkanes by projection pursuit,
Comput. Biol. Chem., 2003, 27, 3, 339-353, https://doi.org/10.1016/S1476-9271(02)00081-6
. [all data]
Junkes, Castanho, et al., 2003
Junkes, B.S.; Castanho, R.D.M.; Amboni, C.; Yunes, R.A.; Heinzen, V.E.F.,
Semiempirical Topological Index: A Novel Molecular Descriptor for Quantitative Structure-Retention Relationship Studies,
Internet Electronic Journal of Molecular Design, 2003, 2, 1, 33-49. [all data]
Perkin Elmer Instruments, 2002
Perkin Elmer Instruments,
Detailed hydrocarbon analysis (DHAX) Model 4015, 2002, retrieved from http://www.perkinelmer.com/instruments. [all data]
Flanagan, Streete, et al., 1997
Flanagan, R.J.; Streete, P.J.; Ramsey, J.D.,
Volatile Substance Abuse, UNODC Technical Series, No 5, United Nations, Office on Drugs and Crime, Vienna International Centre, PO Box 500, A-1400 Vienna, Austria, 1997, 56, retrieved from http://www.odccp.org/pdf/technicalseries1997-01-011.pdf. [all data]
Strete, Ruprah, et al., 1992
Strete, P.J.; Ruprah, M.; Ramsey, J.D.; Flanagan, R.J.,
Detection and identification of volatile substances by headspace capillary gas chromatography to aid the diagnosis of acute poisoning,
Analyst, 1992, 117, 7, 1111-1127, https://doi.org/10.1039/an9921701111
. [all data]
Robinson and Odell, 1971
Robinson, P.G.; Odell, A.L.,
A system of standard retention indices and its uses. The characterisation of stationary phases and the prediction of retention indices,
J. Chromatogr., 1971, 57, 1-10, https://doi.org/10.1016/0021-9673(71)80001-8
. [all data]