Allene
- Formula: C3H4
- Molecular weight: 40.0639
- IUPAC Standard InChIKey: IYABWNGZIDDRAK-UHFFFAOYSA-N
- CAS Registry Number: 463-49-0
- Chemical structure:
View 3d structure (requires JavaScript / HTML 5) - Other names: Propadiene; 1,2-Propadiene; sym-Allylene; Dimethylenemethane; CH2=C=CH2; Propa-1,2-diene

Gas phase thermochemistry data

Data compiled by: Glushko Thermocenter, Russian Academy of Sciences, Moscow
Constant pressure heat capacity of gas
Cp,gas (J/mol*K) | Temperature (K) | Reference | Comment |
---|---|---|---|
33.32 | 50. | Thermodynamics Research Center, 1997 | Recommended values are in close agreement with those obtained from earlier statistical thermodynamics calculation [ Kilpatrick J.E., 1949]. |
35.99 | 100. | ||
40.82 | 150. | ||
46.31 | 200. | ||
55.67 | 273.15 | ||
59.03 | 298.15 | ||
59.28 | 300. | ||
72.09 | 400. | ||
83.00 | 500. | ||
92.07 | 600. | ||
99.73 | 700. | ||
106.3 | 800. | ||
112.0 | 900. | ||
117.0 | 1000. | ||
121.4 | 1100. | ||
125.2 | 1200. | ||
128.5 | 1300. | ||
131.4 | 1400. | ||
134.0 | 1500. |
Constant pressure heat capacity of gas
Cp,gas (J/mol*K) | Temperature (K) | Reference | Comment |
---|---|---|---|
40.63 ± 0.16 | 148.2 | Kistiakowsky G.B., 1940 | Please also see Kistiakowsky G.B., 1940, 2. |
41.49 ± 0.17 | 157.8 | ||
47.53 ± 0.19 | 213.1 | ||
48.30 ± 0.19 | 218.4 | ||
49.02 ± 0.20 | 223.7 | ||
53.31 ± 0.21 | 258.0 | ||
55.23 ± 0.22 | 272.16 | ||
59.33 ± 0.24 | 300.00 | ||
63.81 ± 0.26 | 334.00 | ||
67.86 ± 0.27 | 366.45 |

Phase change data

Data compiled as indicated in comments:
BS - Robert L. Brown and Stephen E. Stein
TRC - Thermodynamics Research Center, NIST Boulder Laboratories, Chris Muzny director
AC - William E. Acree, Jr., James S. Chickos
Quantity | Value | Units | Method | Reference | Comment |
---|---|---|---|---|---|
Tboil | 240. ± 2. | K | AVG | N/A | Average of 7 values; Individual data points |
Quantity | Value | Units | Method | Reference | Comment |
Tfus | 137.1 | K | N/A | Kistiakowsky, Ruhoff, et al., 1936 | Uncertainty assigned by TRC = 0.3 K; TRC |
Tfus | 127. | K | N/A | Lespieau and Chavanne, 1905 | Uncertainty assigned by TRC = 10. K; TRC |
Quantity | Value | Units | Method | Reference | Comment |
Ttriple | 136.59 | K | N/A | Pomerantz, Fookson, et al., 1954 | Uncertainty assigned by TRC = 0.2 K; TRC |
Quantity | Value | Units | Method | Reference | Comment |
Tc | 394. | K | N/A | Tsonopoulos and Ambrose, 1996 | |
Quantity | Value | Units | Method | Reference | Comment |
Pc | 52.5 | bar | N/A | Tsonopoulos and Ambrose, 1996 |
Enthalpy of vaporization
ΔvapH (kJ/mol) | Temperature (K) | Method | Reference | Comment |
---|---|---|---|---|
22.6 | 259. | A | Stephenson and Malanowski, 1987 | Based on data from 136. to 274. K.; AC |
19.9 | 231. | A | Stephenson and Malanowski, 1987 | Based on data from 193. to 246. K.; AC |
21.3 | 223. | N/A | Stull, 1947 | Based on data from 153. to 238. K.; AC |
22.9 | 174. | N/A | Lamb and Roper, 1940 | Based on data from 138. to 189. K. See also Boublik, Fried, et al., 1984.; AC |
20.9 | 220. | MM | Livingston and Heisig, 1930 | Based on data from 203. to 236. K.; AC |
21.5 | 245. | N/A | Maass and Wright, 1921 | Based on data from 200. to 260. K. See also Boublik, Fried, et al., 1984.; AC |
Antoine Equation Parameters
log10(P) = A − (B / (T + C))
P = vapor pressure (bar)
T = temperature (K)
View plot Requires a JavaScript / HTML 5 canvas capable browser.
Temperature (K) | A | B | C | Reference | Comment |
---|---|---|---|---|---|
152.5 to 238. | 3.79809 | 755.286 | -39.159 | Stull, 1947 | Coefficents calculated by NIST from author's data. |

Reaction thermochemistry data

Data compiled as indicated in comments:
B - John E. Bartmess
ALS - Hussein Y. Afeefy, Joel F. Liebman, and Stephen E. Stein
M - Michael M. Meot-Ner (Mautner) and Sharon G. Lias
RCD - Robert C. Dunbar
Individual Reactions
C3H3- + =
Quantity | Value | Units | Method | Reference | Comment |
---|---|---|---|---|---|
ΔrH° | 1590. ± 8.4 | kJ/mol | D-EA | Robinson, Polak, et al., 1995 | gas phase; Neutral acid: allene. Propyne would be 1.0 kcal/mol less acidic.; B |
ΔrH° | 1596. ± 13. | kJ/mol | G+TS | Robinson, Polak, et al., 1995 | gas phase; Relative to MeOH at 375.0; kinetic scheme factors in isomerization; B |
ΔrH° | 1592. ± 8.8 | kJ/mol | D-EA | Oakes and Ellison, 1983 | gas phase; Neutral acid: allene. Propyne would be 1.0 kcal/mol less acidic.; B |
Quantity | Value | Units | Method | Reference | Comment |
ΔrG° | 1560. ± 13. | kJ/mol | IMRE | Robinson, Polak, et al., 1995 | gas phase; Relative to MeOH at 375.0; kinetic scheme factors in isomerization; B |
ΔrG° | 1556. ± 9.2 | kJ/mol | H-TS | Oakes and Ellison, 1983 | gas phase; Neutral acid: allene. Propyne would be 1.0 kcal/mol less acidic.; B |
Quantity | Value | Units | Method | Reference | Comment |
---|---|---|---|---|---|
ΔrH° | -295.1 ± 1.0 | kJ/mol | Chyd | Kistiakowsky, Ruhoff, et al., 1936, 2 | gas phase; Reanalyzed by Cox and Pilcher, 1970, Original value = -298.2 ± 0.84 kJ/mol; At 355 °K; ALS |
(CAS Reg. No. 86046-90-4 • 4294967295) +
= CAS Reg. No. 86046-90-4
By formula: (CAS Reg. No. 86046-90-4 • 4294967295C3H4) + C3H4 = CAS Reg. No. 86046-90-4
Quantity | Value | Units | Method | Reference | Comment |
---|---|---|---|---|---|
ΔrH° | 62. ± 15. | kJ/mol | Ther | Bartmess and Burnham, 1984 | gas phase; value altered from reference due to change in acidity scale; B |
(CAS Reg. No. 83268-51-3 • 4294967295) +
= CAS Reg. No. 83268-51-3
By formula: (CAS Reg. No. 83268-51-3 • 4294967295C3H4) + C3H4 = CAS Reg. No. 83268-51-3
Quantity | Value | Units | Method | Reference | Comment |
---|---|---|---|---|---|
ΔrH° | 106. ± 10. | kJ/mol | N/A | Bartmess and Burnham, 1984 | gas phase; value altered from reference due to change in acidity scale; B |
(CAS Reg. No. 1724-46-5 • 4294967295) +
= CAS Reg. No. 1724-46-5
By formula: (CAS Reg. No. 1724-46-5 • 4294967295C3H4) + C3H4 = CAS Reg. No. 1724-46-5
Quantity | Value | Units | Method | Reference | Comment |
---|---|---|---|---|---|
ΔrH° | 210. ± 9.2 | kJ/mol | N/A | Bartmess, Scott, et al., 1979 | gas phase; value altered from reference due to change in acidity scale; B |
By formula: C3H4 = C3H4
Quantity | Value | Units | Method | Reference | Comment |
---|---|---|---|---|---|
ΔrH° | -3.8 ± 2.1 | kJ/mol | Cm | Cordes and Gunzler, 1959 | gas phase; Reanalyzed by Cox and Pilcher, 1970, Original value = -3.4 kJ/mol; ALS |
(CAS Reg. No. 86046-88-0 • 4294967295) +
= CAS Reg. No. 86046-88-0
By formula: (CAS Reg. No. 86046-88-0 • 4294967295C3H4) + C3H4 = CAS Reg. No. 86046-88-0
Quantity | Value | Units | Method | Reference | Comment |
---|---|---|---|---|---|
ΔrH° | 111. ± 39. | kJ/mol | Ther | Bartmess and Burnham, 1984 | gas phase; Between H2O, MeOH; B |
By formula: Rh+ + C3H4 = (Rh+ • C3H4)
Enthalpy of reaction
ΔrH° (kJ/mol) | T (K) | Method | Reference | Comment |
---|---|---|---|---|
222. (+19.,-0.) | CID | Chen and Armetrout, 1995 | gas phase; guided ion beam CID; M |
By formula: Cr+ + C3H4 = (Cr+ • C3H4)
Quantity | Value | Units | Method | Reference | Comment |
---|---|---|---|---|---|
ΔrH° | 176. ± 8.4 | kJ/mol | CIDT | Fisher and Armentrout, 1992 | propyne or allene; RCD |

Gas phase ion energetics data

Data evaluated as indicated in comments:
HL - Edward P. Hunter and Sharon G. Lias
L - Sharon G. Lias
Data compiled as indicated in comments:
B - John E. Bartmess
LL - Sharon G. Lias and Joel F. Liebman
LLK - Sharon G. Lias, Rhoda D. Levin, and Sherif A. Kafafi
RDSH - Henry M. Rosenstock, Keith Draxl, Bruce W. Steiner, and John T. Herron
Quantity | Value | Units | Method | Reference | Comment |
---|---|---|---|---|---|
IE (evaluated) | 9.692 ± 0.004 | eV | N/A | N/A | L |
Quantity | Value | Units | Method | Reference | Comment |
Proton affinity (review) | 775.3 | kJ/mol | N/A | Hunter and Lias, 1998 | HL |
Quantity | Value | Units | Method | Reference | Comment |
Gas basicity | 745.8 | kJ/mol | N/A | Hunter and Lias, 1998 | HL |
Ionization energy determinations
IE (eV) | Method | Reference | Comment |
---|---|---|---|
9.688 ± 0.002 | PE | Yang, Wang, et al., 1990 | LL |
10.06 | PE | Kimura, Katsumata, et al., 1981 | LLK |
9.691 ± 0.004 | PI | Stockbauer, McCulloh, et al., 1979 | LLK |
9.696 ± 0.002 | TE | Parr, Jason, et al., 1978 | LLK |
9.62 ± 0.02 | PE | Bieri, Burger, et al., 1977 | LLK |
9.62 | EI | Lossing, 1972 | LLK |
10.017 ± 0.003 | S | Iverson and Russell, 1972 | LLK |
9.53 ± 0.03 | PI | Matthews and Warneck, 1969 | RDSH |
9.83 | PE | Dewar and Worley, 1969 | RDSH |
9.69 | PE | Baker and Turner, 1969 | RDSH |
9.62 ± 0.04 | PI | Parr and Elder, 1968 | RDSH |
10. | PE | Leng and Nyberg, 1977 | Vertical value; LLK |
10.2 ± 0.1 | PE | Bieri, Burger, et al., 1977 | Vertical value; LLK |
10.02 | PE | Thomas and Thompson, 1974 | Vertical value; LLK |
10.07 | PE | Brogli, Crandall, et al., 1973 | Vertical value; LLK |
Appearance energy determinations
Ion | AE (eV) | Other Products | Method | Reference | Comment |
---|---|---|---|---|---|
C3H+ | 16.9 ± 0.1 | H2+H | TE | Parr, Jason, et al., 1978 | LLK |
C3H+ | 18.56 ± 0.05 | H2+H | EI | Franklin and Mogenis, 1967 | RDSH |
C3H2+ | 13.5 ± 0.2 | H2 | TE | Parr, Jason, et al., 1978 | LLK |
C3H2+ | 14.34 ± 0.08 | H2 | EI | Franklin and Mogenis, 1967 | RDSH |
C3H3+ | 11.60 ± 0.01 | H | PI | Stockbauer and Rosenstock, 1978 | LLK |
C3H3+ | 11.48 ± 0.02 | ? | TE | Parr, Jason, et al., 1978 | LLK |
C3H3+ | 11.47 | H | EI | Lossing, 1972 | LLK |
C3H3+ | 11.48 | H | PI | Matthews and Warneck, 1969 | RDSH |
C3H3+ | 11.48 ± 0.02 | H | PI | Parr and Elder, 1968 | RDSH |
C3H22+ | 32.5 ± 0.2 | ? | EI | Franklin and Mogenis, 1967 | RDSH |
De-protonation reactions
C3H3- + =
Quantity | Value | Units | Method | Reference | Comment |
---|---|---|---|---|---|
ΔrH° | 1590. ± 8.4 | kJ/mol | D-EA | Robinson, Polak, et al., 1995 | gas phase; Neutral acid: allene. Propyne would be 1.0 kcal/mol less acidic.; B |
ΔrH° | 1596. ± 13. | kJ/mol | G+TS | Robinson, Polak, et al., 1995 | gas phase; Relative to MeOH at 375.0; kinetic scheme factors in isomerization; B |
ΔrH° | 1592. ± 8.8 | kJ/mol | D-EA | Oakes and Ellison, 1983 | gas phase; Neutral acid: allene. Propyne would be 1.0 kcal/mol less acidic.; B |
Quantity | Value | Units | Method | Reference | Comment |
ΔrG° | 1560. ± 13. | kJ/mol | IMRE | Robinson, Polak, et al., 1995 | gas phase; Relative to MeOH at 375.0; kinetic scheme factors in isomerization; B |
ΔrG° | 1556. ± 9.2 | kJ/mol | H-TS | Oakes and Ellison, 1983 | gas phase; Neutral acid: allene. Propyne would be 1.0 kcal/mol less acidic.; B |

Ion clustering data

Data compiled as indicated in comments:
RCD - Robert C. Dunbar
M - Michael M. Meot-Ner (Mautner) and Sharon G. Lias
Clustering reactions
By formula: Cr+ + C3H4 = (Cr+ • C3H4)
Quantity | Value | Units | Method | Reference | Comment |
---|---|---|---|---|---|
ΔrH° | 176. ± 8.4 | kJ/mol | CIDT | Fisher and Armentrout, 1992 | propyne or allene; RCD |
By formula: Rh+ + C3H4 = (Rh+ • C3H4)
Enthalpy of reaction
ΔrH° (kJ/mol) | T (K) | Method | Reference | Comment |
---|---|---|---|---|
222. (+19.,-0.) | CID | Chen and Armetrout, 1995 | gas phase; guided ion beam CID; M |

Kovats' RI, non-polar column, isothermal

Column type | Active phase | Temperature (C) | I | Reference | Comment |
---|---|---|---|---|---|
Capillary | CP Sil 5 CB | 20. | 329.5 | Do and Raulin, 1992 | 25. m/0.15 mm/2. μm, H2 |
Capillary | PoraPLOT Q | 100. | 311. | Do and Raulin, 1989 | 10. m/0.32 mm/10. μm, H2 |
Capillary | PoraPLOT Q | 160. | 316. | Do and Raulin, 1989 | 10. m/0.32 mm/10. μm, H2 |
Packed | Squalane | 27. | 317. | Hively and Hinton, 1968 | He, Chromosorb P; Column length: 15. m; Column diameter: 0.25 mm |
Packed | Squalane | 49. | 318. | Hively and Hinton, 1968 | He, Chromosorb P; Column length: 15. m; Column diameter: 0.25 mm |
Packed | Squalane | 67. | 319. | Hively and Hinton, 1968 | He, Chromosorb P; Column length: 15. m; Column diameter: 0.25 mm |
Packed | Squalane | 86. | 320. | Hively and Hinton, 1968 | He, Chromosorb P; Column length: 15. m; Column diameter: 0.25 mm |
Packed | Squalane | 26. | 336. | Zulaïca and Guiochon, 1966 | Column length: 10. m |

Kovats' RI, non-polar column, custom temperature program

Column type | Active phase | I | Reference | Comment |
---|---|---|---|---|
Capillary | DB-1 | 326. | Hoekman, 1993 | 60. m/0.32 mm/1.0 μm, He; Program: -40 C for 12 min; -40 - 125 C at 3 deg.min; 125-185 C at 6 deg/min; 185 - 220 C at 20 deg/min; hold 220 C for 2 min |

Normal alkane RI, non-polar column, temperature ramp

Column type | Active phase | I | Reference | Comment |
---|---|---|---|---|
Capillary | Polydimethyl siloxane: CP-Sil 5 CB | 326. | Bramston-Cook, 2013 | 60. m/0.25 mm/1.0 μm, Helium, 45. C @ 1.45 min, 3.6 K/min, 210. C @ 2.72 min |
Capillary | Petrocol DH | 337. | Supelco, 2012 | 100. m/0.25 mm/0.50 μm, Helium, 20. C @ 15. min, 15. K/min, 220. C @ 30. min |

Vibrational and/or electronic energy levels

Data compiled by: Takehiko Shimanouchi

Symmetry:   D2d     Symmetry Number σ = 4

 Sym.   No   Approximate   Selected Freq.  Infrared   Raman   Comments
 Species   type of mode   Value   Rating   Value  Phase  Value  Phase

a1 1 CH2 s-str 3015  A 3015.0 gas
a1 2 CH2 scis 1443  A 1442.6 gas
a1 3 CC str 1073  A 1072.6 gas
b1 4 CH2 twist 865  C 865 gas 865 liq.
b2 5 CH2 s-str 3007  A 3006.7 gas
b2 6 CC str 1957  C 1957 gas 1960 liq.
b2 7 CH2 scis 1398  C 1398 gas 1421 liq.
e 8 CH2 a-str 3086  A 3085.5 gas
e 9 CH2 rock 999  A 999.1 gas
e 10 CH2 wag 841  A 840.8 gas
e 11 CCC deform 355  A 355.3 gas

Source: Shimanouchi, 1972

References

Thermodynamics Research Center, 1997
Thermodynamics Research Center,
Selected Values of Properties of Chemical Compounds., Thermodynamics Research Center, Texas A&M University, College Station, Texas, 1997. [all data]
Kilpatrick J.E., 1949
Kilpatrick J.E.,
Heats, equilibrium constants, and free energies of formation of the C3 to C5 diolefins, styrene, and the methylstyrenes,
J. Res. Nat. Bur. Stand., 1949, 42, 225-240. [all data]
Kistiakowsky G.B., 1940
Kistiakowsky G.B.,
Gaseous heat capacities. II,
J. Chem. Phys., 1940, 8, 610-618. [all data]
Kistiakowsky G.B., 1940, 2
Kistiakowsky G.B.,
The low temperature gaseous heat capacities of certain C3 hydrocarbons,
J. Chem. Phys., 1940, 8, 970-977. [all data]
Kistiakowsky, Ruhoff, et al., 1936
Kistiakowsky, G.B.; Ruhoff, J.R.; Smith, H.A.; Vaughan, W.E.,
Heats of Organic Reactions IV. Hydrogenation of Some Dienes and of Benzene,
J. Am. Chem. Soc., 1936, 58, 146-53. [all data]
Lespieau and Chavanne, 1905
Lespieau, R.; Chavanne, G.,
Liquefaction of Propadiene and Propyne.,
C. R. Hebd. Seances Acad. Sci., 1905, 140, 1035-1036. [all data]
Pomerantz, Fookson, et al., 1954
Pomerantz, P.; Fookson, A.; Mears, T.W.; Rothberg, S.; Howard, F.L.,
Synth. and Phys. Prop. of Several Aliphatic and Alicyclic Hydrocarbons hydrocarbons,
J. Res. Natl. Bur. Stand. (U. S.), 1954, 52, 59-65. [all data]
Tsonopoulos and Ambrose, 1996
Tsonopoulos, C.; Ambrose, D.,
Vapor-Liquid Critical Properties of Elements and Compounds. 6. Unsaturated Aliphatic Hydrocarbons,
J. Chem. Eng. Data, 1996, 41, 645-656. [all data]
Stephenson and Malanowski, 1987
Stephenson, Richard M.; Malanowski, Stanislaw,
Handbook of the Thermodynamics of Organic Compounds, 1987, https://doi.org/10.1007/978-94-009-3173-2
. [all data]
Stull, 1947
Stull, Daniel R.,
Vapor Pressure of Pure Substances. Organic and Inorganic Compounds,
Ind. Eng. Chem., 1947, 39, 4, 517-540, https://doi.org/10.1021/ie50448a022
. [all data]
Lamb and Roper, 1940
Lamb, Arthur B.; Roper, Edwin E.,
The Vapor Pressures of Certain Unsaturated Hydrocarbons,
J. Am. Chem. Soc., 1940, 62, 4, 806-814, https://doi.org/10.1021/ja01861a032
. [all data]
Boublik, Fried, et al., 1984
Boublik, T.; Fried, V.; Hala, E.,
The Vapour Pressures of Pure Substances: Selected Values of the Temperature Dependence of the Vapour Pressures of Some Pure Substances in the Normal and Low Pressure Region, 2nd ed., Elsevier, New York, 1984, 972. [all data]
Livingston and Heisig, 1930
Livingston, Robert; Heisig, G.B.,
THE VAPOR PRESSURE OF ALLENE AS A FUNCTION OF TEMPERATURE,
J. Am. Chem. Soc., 1930, 52, 6, 2409-2410, https://doi.org/10.1021/ja01369a031
. [all data]
Maass and Wright, 1921
Maass, O.; Wright, C.H.,
SOME PHYSICAL PROPERTIES OF HYDROCARBONS CONTAINING TWO AND THREE CARBON ATOMS.,
J. Am. Chem. Soc., 1921, 43, 5, 1098-1111, https://doi.org/10.1021/ja01438a013
. [all data]
Robinson, Polak, et al., 1995
Robinson, M.S.; Polak, M.L.; Bierbaum, V.M.; DePuy, C.H.; Lineberger, W.C.,
Experimental Studies of Allene, Methylacetylene, and the Propargyl Radical: Bond Dissociation Energies, Gas-Phase Acidities, and Ion-Molecule Chemistry,
J. Am. Chem. Soc., 1995, 117, 25, 6766, https://doi.org/10.1021/ja00130a017
. [all data]
Oakes and Ellison, 1983
Oakes, J.M.; Ellison, B.G.,
Photoelectron spectroscopy of the allenyl anion CH2=C=CH-,
J. Am. Chem. Soc., 1983, 105, 2969. [all data]
Kistiakowsky, Ruhoff, et al., 1936, 2
Kistiakowsky, G.B.; Ruhoff, J.R.; Smith, H.A.; Vaughan, W.E.,
Heats of organic reactions. IV. Hydrogenation of some dienes and of benzene,
J. Am. Chem. Soc., 1936, 58, 146-153. [all data]
Cox and Pilcher, 1970
Cox, J.D.; Pilcher, G.,
Thermochemistry of Organic and Organometallic Compounds, Academic Press, New York, 1970, 1-636. [all data]
Bartmess and Burnham, 1984
Bartmess, J.E.; Burnham, R.,
Effect of central substituents on the gas phase acidities of propenes,
J. Org. Chem., 1984, 49, 1382. [all data]
Bartmess, Scott, et al., 1979
Bartmess, J.E.; Scott, J.A.; McIver, R.T., Jr.,
The gas phase acidity scale from methanol to phenol,
J. Am. Chem. Soc., 1979, 101, 6047. [all data]
Cordes and Gunzler, 1959
Cordes, J.F.; Gunzler, H.,
Das propin/propadien-gleichgewicht,
Chem. Ber., 1959, 92, 1055-1062. [all data]
Chen and Armetrout, 1995
Chen, Y.M.; Armetrout, P.B.,
Activation of C2H6, C3H8, and c-C3H6 by Gas-Phase Rh+ and the Thermochemistry of Rh-Ligand Complexes,
J. Am. Chem. Soc., 1995, 117, 36, 9291, https://doi.org/10.1021/ja00141a022
. [all data]
Fisher and Armentrout, 1992
Fisher, E.R.; Armentrout, P.B.,
Activation of Alkanes by Cr+: Unique Reactivity of Ground-State Cr+(6S) and Thermochemistry of Neutral and Ionic Chromium-Carbon Bonds,
J. Am. Chem. Soc., 1992, 114, 6, 2039, https://doi.org/10.1021/ja00032a017
. [all data]
Hunter and Lias, 1998
Hunter, E.P.; Lias, S.G.,
Evaluated Gas Phase Basicities and Proton Affinities of Molecules: An Update,
J. Phys. Chem. Ref. Data, 1998, 27, 3, 413-656, https://doi.org/10.1063/1.556018
. [all data]
Yang, Wang, et al., 1990
Yang, Z.Z.; Wang, L.S.; Lee, Y.T.; Shirley, D.A.; Huang, S.Y.; Lester, W.A., Jr.,
Molecular beam photoelectron spectroscopy of allene,
Chem. Phys. Lett., 1990, 171, 9. [all data]
Kimura, Katsumata, et al., 1981
Kimura, K.; Katsumata, S.; Achiba, Y.; Yamazaki, T.; Iwata, S.,
Ionization energies, Ab initio assignments, and valence electronic structure for 200 molecules
in Handbook of HeI Photoelectron Spectra of Fundamental Organic Compounds, Japan Scientific Soc. Press, Tokyo, 1981. [all data]
Stockbauer, McCulloh, et al., 1979
Stockbauer, R.; McCulloh, K.E.; Parr, A.C.,
The ionization potential of allene,
Int. J. Mass Spectrom. Ion Phys., 1979, 31, 187. [all data]
Parr, Jason, et al., 1978
Parr, A.C.; Jason, A.J.; Stockbauer, R.,
Photoionization and threshold photoelectron-photoion coincidence study of allene from onset to 20eV,
Int. J. Mass Spectrom. Ion Phys., 1978, 26, 23. [all data]
Bieri, Burger, et al., 1977
Bieri, G.; Burger, F.; Heilbronner, E.; Maier, J.P.,
Valence ionization enrgies of hydrocarbons,
Helv. Chim. Acta, 1977, 60, 2213. [all data]
Lossing, 1972
Lossing, F.P.,
Free radicals by mass spectrometry. XLV. Ionization potentials and heats of formation of C3H3, C3H5, and C4H7 radicals and ions,
Can. J. Chem., 1972, 50, 3973. [all data]
Iverson and Russell, 1972
Iverson, A.A.; Russell, B.R.,
A medium resolution study of allene in the vacuum ultraviolet. I. Spectra and a preliminary ionization potential,
Spectrochim. Acta Part A, 1972, 28, 447. [all data]
Matthews and Warneck, 1969
Matthews, C.S.; Warneck, P.,
Heats of formation of CHO+ and C3H3+ by photoionization,
J. Chem. Phys. 5, 1969, 1, 854. [all data]
Dewar and Worley, 1969
Dewar, M.J.S.; Worley, S.D.,
Photoelectron spectra of molecules. I. Ionization potentials of some organic molecules and their interpretation,
J. Chem. Phys., 1969, 50, 654. [all data]
Baker and Turner, 1969
Baker, C.; Turner, D.W.,
Photoelectron spectra of allene and keten; Jahn-Teller distortion in the ionisation of allene,
Chem. Commun., 1969, 480. [all data]
Parr and Elder, 1968
Parr, A.C.; Elder, F.A.,
Photoionization of 1,3butadiene, 1,2-butadiene, allene, and propyne,
J. Chem. Phys., 1968, 49, 2659. [all data]
Leng and Nyberg, 1977
Leng, F.J.; Nyberg, G.L.,
Angular-distribution He(I)/Ne(I) photoelectron spectra of allene,
J. Chem. Soc. Faraday Trans. 2, 1977, 73, 1719. [all data]
Thomas and Thompson, 1974
Thomas, R.K.; Thompson, H.,
The photoelectron spectra of allene, deuteroallenes and tetrafluoroallene,
Proc. R. Soc. London A:, 1974, 339, 29. [all data]
Brogli, Crandall, et al., 1973
Brogli, F.; Crandall, J.K.; Heilbronner, E.; Kloster-Jensen, E.; Sojka, S.A.,
The photoelectron spectra of methyl-substituted allenes and of tetramethyl-bisallenyl,
J. Electron Spectrosc. Relat. Phenom., 1973, 2, 455. [all data]
Franklin and Mogenis, 1967
Franklin, J.L.; Mogenis, A.,
An electron impact study of ions from several dienes,
J. Phys. Chem., 1967, 71, 2820. [all data]
Stockbauer and Rosenstock, 1978
Stockbauer, R.; Rosenstock, H.M.,
Kinetic shift in methane allene ion fragmentation,
Int. J. Mass Spectrom. Ion Phys., 1978, 27, 185. [all data]