1-(2-Phenylethyl)pyridinium
- Formula: C13H14N
- Molecular weight: 184.2570
- IUPAC Standard InChIKey: MGMFSGVTTUUFOE-UHFFFAOYSA-N
- CAS Registry Number: 46345-86-2
- Chemical structure:
View 3d structure (requires JavaScript / HTML 5) - Permanent link for this species. Use this link for bookmarking this species for future reference.

Gas phase ion energetics data

Data compiled by: Sharon G. Lias and Joel F. Liebman
Appearance energy determinations
Ion | AE (eV) | Other Products | Method | Reference | Comment |
---|---|---|---|---|---|
C8H9+[C6H5CH2CH2+] | 2.1 ± 0.35 | C5H5N | CAD | Katritzky, Watson, et al., 1990 |

References

Katritzky, Watson, et al., 1990
Katritzky, A.R.; Watson, C.H.; Dega-Szafran, Z.; Eyler, J.R.,
Collisionally activated dissociation of N-alkylpyridinium cations to pyridine and alkyl cations in the gas phase,
J. Am. Chem. Soc., 1990, 112, 2471. [all data]