3-Aminophenylacetic acid nitrile
- Formula: C8H8N2
- Molecular weight: 132.1625
- IUPAC Standard InChIKey: YIZRGZCXUWSHLN-UHFFFAOYSA-N
- CAS Registry Number: 4623-24-9
- Chemical structure:
View 3d structure (requires JavaScript / HTML 5) - Permanent link for this species. Use this link for bookmarking this species for future reference.

Gas phase ion energetics data

Data compiled by: Henry M. Rosenstock, Keith Draxl, Bruce W. Steiner, and John T. Herron
Ionization energy determinations
IE (eV) | Method | Reference |
---|---|---|
8.31 ± 0.05 | EI | Buchs, 1970 |

References

Buchs, 1970
Buchs, A.,
Etude par spectrometrie de masse de l'ionisation de benzonitriles, de phenylacetonitriles et de N,N-dimethylanilines substitues,
Helv. Chim. Acta, 1970, 53, 2026. [all data]