1,2,4-Triazine-3,5(2H,4H)-dione
- Formula: C3H3N3O2
- Molecular weight: 113.0748
- IUPAC Standard InChIKey: SSPYSWLZOPCOLO-UHFFFAOYSA-N
- CAS Registry Number: 461-89-2
- Chemical structure:
View 3d structure (requires JavaScript / HTML 5) - Other names: 6-Azauracil; NSC 3425; as-Triazine-3,5-diol; as-Triazine-3,5(2H,4H)-dione; Azauracil; AZU; USAF CB-30; 4(6)-Azauracil; IPO 3834; 1,2,4-triazine-3,5-diol

Gas phase ion energetics data

Data compiled as indicated in comments:
LLK - Sharon G. Lias, Rhoda D. Levin, and Sherif A. Kafafi
RDSH - Henry M. Rosenstock, Keith Draxl, Bruce W. Steiner, and John T. Herron
Ionization energy determinations
IE (eV) | Method | Reference | Comment |
---|---|---|---|
10.0 | PE | Ajo, Casarin, et al., 1981 | LLK |
10.2 ± 0.1 | EI | Lifschitz, Bergmann, et al., 1967 | RDSH |
10.18 | PE | Ajo, Casarin, et al., 1981 | Vertical value; LLK |

References

Ajo, Casarin, et al., 1981
Ajo, D.; Casarin, M.; Granozzi, G.; Fragala, I.,
UV photoelectron spectra of 5- and 6-Azauracil,
Chem. Phys. Lett., 1981, 80, 188. [all data]
Lifschitz, Bergmann, et al., 1967
Lifschitz, C.; Bergmann, E.D.; Pullman, B.,
The ionization potentials of biological purines and pyrimidines,
Tetrahedron Lett., 1967, 4583. [all data]