Hydantoin
- Formula: C3H4N2O2
- Molecular weight: 100.0761
- IUPAC Standard InChIKey: WJRBRSLFGCUECM-UHFFFAOYSA-N
- CAS Registry Number: 461-72-3
- Chemical structure:
View 3d structure (requires JavaScript / HTML 5) - Other names: 2,4-Imidazolidinedione; Glycolylurea; Imidazole-2,4(3H,5H)-dione; 2,4(3H,5H)-Imidazoledione; 2-Imidazolin-4(or 5)-one, 2-hydroxy-

Condensed phase thermochemistry data

Data compiled by: Hussein Y. Afeefy, Joel F. Liebman, and Stephen E. Stein
Quantity | Value | Units | Method | Reference | Comment |
---|---|---|---|---|---|
ΔfH°solid | -581.9 ± 1.1 | kJ/mol | Ccb | El-Sayed, 1993 | |
Quantity | Value | Units | Method | Reference | Comment |
ΔcH°solid | -1170.3 ± 0.76 | kJ/mol | Ccb | El-Sayed, 1993 |

Gas phase ion energetics data

Data compiled by: Sharon G. Lias and Joel F. Liebman
Ionization energy determinations
IE (eV) | Method | Reference |
---|---|---|
10.20 ± 0.05 | PE | Vondrak and Cauletti, 1988 |
9.9 | PE | Vondrak and Cauletti, 1988 |

References

El-Sayed, 1993
El-Sayed, N.I.,
The enthalpy of combustion and formation of hydantoin,
Asian J. Chem., 1993, 5, 199-207. [all data]
Vondrak and Cauletti, 1988
Vondrak, T.; Cauletti, C.,
ELectronic structure of hydantoin studied by He I photoelectron spectroscopy and MNDO quantum-chemical calculations,
Spectrochim. Acta A:, 1988, 44, 289. [all data]