2,2=Difluoropropenenitrile
- Formula: C3HF2N
- Molecular weight: 89.0435
- IUPAC Standard InChIKey: PSUCPEMMGCPVFE-UHFFFAOYSA-N
- CAS Registry Number: 461-51-8
- Chemical structure:
View 3d structure (requires JavaScript / HTML 5) - Permanent link for this species. Use this link for bookmarking this species for future reference.

Gas phase ion energetics data

Data compiled by: Henry M. Rosenstock, Keith Draxl, Bruce W. Steiner, and John T. Herron
Ionization energy determinations
IE (eV) | Method | Reference |
---|---|---|
10.6 ± 0.1 | EI | Chelobov, Dubov, et al., 1969 |
Appearance energy determinations
Ion | AE (eV) | Other Products | Method | Reference | Comment |
---|---|---|---|---|---|
C3NF2+ | 15.9 ± 0.1 | H | EI | Chelobov, Dubov, et al., 1969 | |
C3HNF+ | 13.1 ± 0.1 | F | EI | Chelobov, Dubov, et al., 1969 |

References

Chelobov, Dubov, et al., 1969
Chelobov, F.N.; Dubov, S.S.; Tikhomirov, M.V.; Dobrovitskii, M.I.; Gitel', P.O.; Rozenshtein, S.M.,
Processes in fluoroacrylonitriles under electron impact,
Zh. Fiz. Khim., 1969, 43, 33, In original 15. [all data]